program: Gaussian 09
title: 000289176
version: EM64L-G09RevD.01
frameworkgroup: C1[X(C20H12ClNO5)]
method: RPBEPBE
basis: SDD
operation: Freq
keyword: #p
keyword: freq=noraman
keyword: PBEPBE/SDD
title: #p freq=noraman PBEPBE/SDD
converged: NO YES NO NO
title: Mulliken charges:
elementType: Cl O O O O O N C C C C C C C C C C C C C C C C C C C C H H H H H H H H H H H H
charge: -0.058211 -0.377061 -0.337954 -0.462585 -0.167572 -0.249337 -0.447346 0.179308 0.198890 0.089997 0.299678 0.070561 0.277675 0.369625 -0.273680 -0.204134 -0.157304 0.312404 -0.433736 -0.395428 -0.360671 -0.352689 -0.222571 -0.231178 -0.260818 0.242398 -0.681703 0.299530 0.301001 0.195792 0.317455 0.241439 0.429205 0.245213 0.240168 0.414584 0.357726 0.295530 0.295798
chargesum: 0.00000
title: Mulliken charges with hydrogens summed into heavy atoms:
elementType: Cl O O O O O N C C C C C C C C C C C C C C C C C C C C
charge: -0.058211 0.037523 0.019772 -0.462585 -0.167572 -0.249337 -0.018141 0.179308 0.198890 0.089997 0.299678 0.070561 0.277675 0.369625 -0.273680 -0.204134 -0.157304 0.312404 -0.134206 -0.094427 -0.164878 -0.035234 0.018868 0.014035 -0.020650 0.242398 -0.090375
polarizability: 5.09296245e+02 6.60186212e+01 3.27515024e+02 3.09387675e-01 -1.49814383e-01 9.50616653e+01
1716.lowfreq: -13.9622 -6.5713 -2.8701 0.0016 0.0016 0.0019 7.5617 28.4965 39.6820
frequency: -12.0655 28.4827 39.6793 58.1021 69.8881 73.5481 86.7022 124.8425 133.8186 157.0467 162.3926 204.0668 211.7230 234.4872 249.5301 283.7787 296.6867 314.1500 316.3611 359.8026 362.7698 382.5860 404.1309 405.6586 442.6221 443.1229 447.5185 454.8079 474.4718 495.6690 509.5985 530.4028 535.9557 542.7838 581.6407 604.0975 643.6440 659.4598 659.8401 680.1897 704.3892 705.3103 724.4458 759.4956 761.7674 777.0339 799.2074 821.2123 828.3574 864.4729 880.5525 898.1891 900.2048 904.3807 949.3592 968.1773 972.5874 1001.9968 1008.2025 1014.0851 1019.8455 1023.5200 1042.4258 1073.3975 1076.8959 1104.1600 1133.3721 1165.0109 1165.2823 1178.4601 1186.6640 1213.0418 1226.0325 1255.4849 1256.5709 1266.7496 1271.6014 1295.2784 1301.2584 1330.6152 1372.1658 1377.0589 1411.0970 1417.3554 1420.4626 1429.4121 1439.2499 1452.5137 1464.8365 1498.7399 1510.6525 1524.0954 1559.5329 1575.4696 1580.9166 1590.8096 1602.1411 1614.5755 1637.2120 2342.0242 3063.5854 3096.8789 3105.1590 3142.5109 3146.1412 3146.8614 3163.8738 3171.9454 3180.2227 3192.5866 3539.9477
redmass: 6.6546 7.8102 5.0333 6.4486 11.7308 4.9227 3.9933 4.6402 11.8793 6.9149 7.1025 7.2995 6.6436 9.3678 4.6251 5.7954 2.3180 7.6646 2.3606 8.0007 6.9176 8.9965 9.4153 7.6794 2.6231 11.3276 4.8843 7.4730 8.8693 9.1061 4.1507 8.5899 4.1272 7.0341 3.8200 7.5734 4.2897 4.8390 6.1384 6.3880 6.7013 4.1899 6.9928 6.7610 2.6338 2.5223 2.1573 6.7891 1.7304 6.8785 2.2778 3.3916 6.9427 1.7852 5.9901 1.3927 1.4251 1.1003 1.3594 8.0341 1.3506 4.8195 2.1769 1.0646 2.1409 2.6146 2.8450 1.8137 1.1135 1.2175 1.1524 1.7564 2.5936 3.2069 2.2115 1.3905 1.9221 4.7386 2.8208 2.9201 6.8212 5.0223 7.2421 1.3440 2.8284 2.6448 3.0269 4.2638 3.9005 2.8714 3.7213 5.8582 5.0501 7.3304 4.2473 7.0891 4.7285 4.4712 3.0782 1.0782 1.0567 1.0885 1.0836 1.1084 1.0887 1.0889 1.0941 1.0948 1.0986 1.0955 1.0650
irintensity: 2.2044 0.5606 0.0727 1.8549 0.2203 14.4299 5.3463 1.4369 1.9125 0.3225 0.0318 10.3266 0.0596 1.4763 3.3153 1.3413 21.2786 5.6888 43.9314 5.6915 19.8178 1.1827 2.6678 0.1141 44.9969 11.6129 3.0028 36.2247 1.1890 4.4020 0.0027 4.6186 0.0490 7.7467 0.0977 8.8973 4.8733 5.7936 4.7754 2.3803 50.7139 18.7079 2.2328 49.8543 54.0165 30.4478 31.8782 0.5995 19.3013 28.9483 12.7486 3.4819 34.6655 1.7753 11.9704 0.9586 0.0064 40.9177 0.7783 54.6048 5.4260 18.3221 42.4892 181.2226 1.7809 15.9941 58.0254 36.2767 1.2059 10.2192 5.8258 61.3725 27.9996 20.3989 46.2712 23.7213 124.9145 322.3040 137.2535 285.6658 207.6823 359.1255 5.7849 28.0837 9.1962 13.6054 9.2603 190.8468 65.8955 461.1169 257.0034 348.9809 227.3440 443.5025 96.8593 1.9034 62.9193 37.7788 19.6761 209.5697 4.9353 14.2695 255.2620 0.9827 8.0397 12.1335 16.6074 10.0149 14.8711 8.7569 44.5274
temp: 298.150 k
press: 1.00000 atm
elementType: 17 8 8 8 8 8 7 6 6 6 6 6 6 6 6 6 6 6 6 6 6 6 6 6 6 6 6 1 1 1 1 1 1 1 1 1 1 1 1
symmnumber: 1
zpe: 719345.6 jmol-1
zpe.correction: 0.273984 hartree
zpe.thermalcorrener: 0.294735 hartree
zpe.thermalcorrenthalpy: 0.295679 hartree
zpe.thermalcorrgfe: 0.223964 hartree
zpe.sumelectzpe: -1658.475388 hartree
zpe.sumelectthermal: -1658.454637 hartree
zpe.sumelectthermalent: -1658.453693 hartree
zpe.sumelectthermalfe: -1658.525409 hartree
dipole: -4.8376 -1.6482 0.0479
dipole: 5.1109
quadrupole: -126.2865 -168.4889 -163.8406
quadrupole: 8.2869 0.2404 -0.0989
quadrupole: 26.5855 -15.6169 -10.9686 8.2869 0.2404 -0.0989
hfenergy: -1658.7493725 hartree
pointgroup: C01 [X(C20H12Cl1N1O5)]
dipole: 1.9617316 -0.440244 0.0310799 debye
polarizability: 520.8792849|-45.37723|315.3002706|12.7852328|5.9500668|95.6933794 unknown
InChI: InChI=1S/C20H12ClNO5/c21-8-13(23)22-12-7-3-6-11-14(12)20(27)16-15(19(11)26)17(24)9-4-1-2-5-10(9)18(16)25/h1-7,22,24-25H,8H2
charge 0 multiplicity 1
39 atoms
Cl -3.704898 -3.865209 -0.299069
O  1.182774 -2.619954 -0.122947
O  3.329952 2.557636 0.127856
O  -1.056321 -1.673801 -0.163313
O  0.869749 3.506544 0.077931
O  -5.828917 -0.393502 -0.274869
N  -3.497532 -0.80378 -0.212996
C  0.830474 -0.206331 -0.050096
C  1.393816 1.131649 0.01496
C  -1.543956 0.694035 -0.097087
C  -1.009062 2.019455 -0.033551
C  -0.606733 -0.427871 -0.10485
C  3.114756 -1.200532 -0.009034
C  3.679703 0.119054 0.056723
C  0.471912 2.297818 0.024883
C  1.679745 -1.35326 -0.062384
C  2.795738 1.278412 0.066567
C  -2.976967 0.51084 -0.151172
C  -1.872792 3.13526 -0.023468
C  3.962704 -2.345622 -0.020515
C  5.103175 0.238276 0.110838
C  -3.824273 1.652026 -0.140777
C  -3.267456 2.944734 -0.077068
C  5.353561 -2.199212 0.03272
C  5.925591 -0.896181 0.099091
C  -4.825695 -1.174949 -0.269805
C  -5.157912 -2.668661 -0.342548
H  -1.42333 4.130925 0.02619
H  3.49268 -3.33142 -0.071481
H  5.595756 1.218423 0.164105
H  -4.904457 1.504828 -0.183305
H  -3.938009 3.810515 -0.06936
H  -2.756849 -1.544769 -0.212727
H  6.002846 -3.08024 0.023863
H  7.013358 -0.779269 0.141352
H  0.119167 -2.510717 -0.152956
H  4.320506 2.533666 0.15586
H  -5.692194 -2.86685 -1.283911
H  -5.801512 -2.929266 0.510549
