program: Gaussian 09
title: 000289164
version: EM64L-G09RevD.01
frameworkgroup: C1[X(C15H15NO4S)]
method: RPBEPBE
basis: SDD
operation: Freq
keyword: #p
keyword: freq=noraman
keyword: PBEPBE/SDD
title: #p freq=noraman PBEPBE/SDD
converged: YES YES NO NO
title: Mulliken charges:
elementType: S O O O O N C C C C C C C C C C C C C C C H H H H H H H H H H H H H H H
charge: 0.920881 -0.529614 -0.508729 -0.410358 -0.254478 -0.233963 -0.096329 0.179915 -0.676221 0.208424 -0.238983 -0.186657 -0.268758 0.451249 -0.378747 -0.375365 -0.344866 -0.238993 -0.232175 -0.800385 0.115936 0.245471 0.246976 0.265568 0.289664 0.274051 0.248688 0.244120 0.242297 0.276015 0.235397 0.239330 0.231520 0.244410 0.229613 0.385097
chargesum: 0.00000
title: Mulliken charges with hydrogens summed into heavy atoms:
elementType: S O O O O N C C C C C C C C C C C C C C C
charge: 0.920881 -0.529614 -0.508729 -0.025262 -0.254478 -0.233963 -0.096329 0.179915 0.081793 0.208424 0.050680 0.087394 -0.020070 0.451249 -0.134627 -0.133068 -0.068850 -0.003596 0.007155 -0.094842 0.115936
polarizability: 2.18090044e+02 1.38814516e+01 2.33595036e+02 2.00292414e+01 -1.77235858e+01 2.02035914e+02
1716.lowfreq: -9.2018 -0.0017 -0.0015 -0.0012 6.8879 10.9019 18.9950 29.8904 36.5591
frequency: 18.4166 29.7523 36.3166 38.0199 52.0500 74.9459 96.9974 123.5630 129.0701 137.4947 153.0390 177.3401 209.2995 221.7777 231.2361 245.6086 270.7285 283.5821 296.0472 345.7356 351.7376 376.2324 385.8830 394.9824 411.2554 426.8558 442.6740 507.2929 521.2232 542.0225 569.0228 581.7038 585.7720 602.8355 622.2417 686.3045 705.2979 708.2200 776.4527 777.8000 781.2676 792.0287 804.0989 826.0383 845.0987 888.7051 929.8458 958.8812 973.8983 978.1444 989.2256 990.6413 992.2578 999.9969 1019.3676 1048.7435 1050.7051 1054.1988 1072.3398 1096.2621 1119.5574 1127.0688 1160.4969 1177.5582 1184.8792 1218.6051 1233.7491 1264.8724 1297.6829 1320.9812 1374.1082 1382.0745 1391.5334 1398.4342 1407.9938 1428.5388 1439.6956 1464.8790 1470.3869 1473.7844 1474.8075 1491.5579 1560.4232 1593.3196 1594.6501 1595.1755 1613.2111 2959.0013 2980.5512 3056.6174 3063.3576 3092.8156 3097.9484 3133.7881 3135.8664 3138.1197 3150.4892 3162.2149 3168.3708 3172.8521 3177.8118 3511.2509
redmass: 6.3367 5.7090 5.3763 1.0567 4.5500 5.2716 5.4387 6.2325 5.3309 5.8774 5.1072 5.7156 5.5593 2.8521 2.1172 4.0712 2.5812 5.1390 4.5434 3.4042 6.6193 4.0423 4.9438 8.7735 2.8509 3.7175 6.4217 3.1753 5.0262 3.3915 3.8815 1.9606 5.2356 2.6702 6.7910 3.6215 3.6763 3.9274 3.9540 4.1621 1.4787 6.0718 12.0024 1.3660 1.2479 1.5315 15.1467 1.3162 1.4232 1.3982 2.0364 2.6816 5.3870 1.3727 4.5768 1.5975 2.3884 2.1968 1.3968 2.3172 1.2893 1.4426 1.5887 1.0774 1.1316 3.0659 3.8817 1.5251 1.2641 2.5769 9.9701 5.8177 3.0839 1.2198 1.1279 2.1873 1.0644 2.2449 1.1170 2.0320 1.1255 1.0891 6.3453 6.3267 6.1234 6.3645 8.4581 1.0378 1.0390 1.0947 1.0947 1.1001 1.1005 1.0863 1.0897 1.0902 1.0895 1.0936 1.0953 1.1001 1.0948 1.0641
irintensity: 1.6686 0.4078 1.5066 0.2102 0.4980 0.8178 0.5054 0.2713 0.5294 1.3737 1.5050 2.7663 2.4195 2.5356 6.9402 10.4124 7.7125 4.9018 1.5861 3.4483 13.4565 1.7149 4.3572 10.4609 0.3906 35.7378 32.2438 77.1460 5.3061 15.1872 14.0390 40.4624 37.4319 37.5486 0.5438 64.1073 2.5393 6.0526 5.4276 9.3240 50.1344 5.3562 103.7362 24.5095 1.4785 1.4063 53.5813 1.0907 1.6488 3.8832 1.0158 3.2014 0.7770 1.1027 84.7418 22.2753 24.4199 11.3799 25.8221 19.5921 6.9963 11.7840 26.5094 1.0815 11.9089 6.5411 14.4163 1.8311 3.6513 46.0651 14.9384 0.0803 9.1183 16.6254 10.5974 24.9648 24.3515 13.5898 17.3816 15.9005 15.1736 10.3263 2.5186 9.3923 42.2056 17.6934 270.4934 26.9263 23.0763 8.8336 15.1057 13.8607 8.2130 4.9578 11.6386 9.3499 5.2357 5.3268 1.9013 19.2412 4.4863 36.1693
temp: 298.150 k
press: 1.00000 atm
elementType: 16 8 8 8 8 7 6 6 6 6 6 6 6 6 6 6 6 6 6 6 6 1 1 1 1 1 1 1 1 1 1 1 1 1 1 1
symmnumber: 1
zpe: 702804.0 jmol-1
zpe.correction: 0.267684 hartree
zpe.thermalcorrener: 0.288753 hartree
zpe.thermalcorrenthalpy: 0.289698 hartree
zpe.thermalcorrgfe: 0.215889 hartree
zpe.sumelectzpe: -1332.610418 hartree
zpe.sumelectthermal: -1332.589348 hartree
zpe.sumelectthermalent: -1332.588404 hartree
zpe.sumelectthermalfe: -1332.662213 hartree
dipole: 2.6394 4.4868 -2.6572
dipole: 5.8445
quadrupole: -109.5602 -146.2810 -125.9804
quadrupole: 1.0428 6.3652 -13.8814
quadrupole: 17.7137 -19.0071 1.2934 1.0428 6.3652 -13.8814
hfenergy: -1332.8781018 hartree
pointgroup: C01 [X(C15H15N1O4S1)]
dipole: 0.9041347 2.0900558 -0.3185413 debye
polarizability: 189.8659578|7.8420937|241.8948388|19.9218345|-3.0919272|221.9601985 unknown
InChI: InChI=1S/C8H8NO2.C7H7O2S/c1-9-7-5-3-2-4-6(7)8(10)11;1-6-2-4-7(5-3-6)10(8)9/h2-5,10H,1H3;2-5H,1H3
charge 0 multiplicity 1
36 atoms
S  0.276497 -2.170903 -0.58643
O  0.928001 -2.594313 -2.032029
O  -0.050054 -3.320043 0.509489
O  -1.437844 -0.756292 1.593573
O  -2.218246 1.318172 2.250985
N  -1.509749 -1.18172 -1.096603
C  1.458085 -0.907096 0.163893
C  -1.28823 0.22331 -1.195063
C  -1.904514 -1.897825 -2.339846
C  -1.386352 1.055519 -0.020986
C  1.630832 -0.893241 1.55568
C  2.18874 -0.089027 -0.713914
C  -1.067948 0.865086 -2.453242
C  3.331806 0.868643 1.251937
C  2.579515 0.004214 2.091452
C  3.123454 0.807079 -0.151868
C  -1.257012 2.462779 -0.151131
C  -0.938975 2.261392 -2.558114
C  -1.025428 3.069744 -1.399745
C  4.365032 1.811872 1.839585
C  -1.725486 0.583473 1.355475
H  -1.151913 -1.893213 -3.153829
H  -2.844166 -1.440946 -2.700208
H  -2.105986 -2.947909 -2.071678
H  1.052898 -1.572651 2.187543
H  2.050844 -0.169339 -1.796298
H  -0.995684 0.252471 -3.357005
H  2.737287 0.0323 3.175647
H  3.702564 1.460716 -0.814051
H  -1.367693 3.067012 0.755038
H  -0.766851 2.719659 -3.538494
H  -0.926666 4.157555 -1.472518
H  4.096716 2.120811 2.864542
H  5.357083 1.322848 1.892425
H  4.480655 2.721472 1.225135
H  -1.762811 -1.010207 2.499953
