program: Gaussian 09
title: 000289174
version: EM64L-G09RevD.01
frameworkgroup: C1[X(C21H20N2O2)]
method: RPBEPBE
basis: SDD
operation: Freq
keyword: #p
keyword: freq=noraman
keyword: PBEPBE/SDD
title: #p freq=noraman PBEPBE/SDD
converged: YES YES NO NO
title: Mulliken charges:
elementType: O O N N C C C C C C C C C C C C C C C C C C C C C H H H H H H H H H H H H H H H H H H H H
charge: -0.293078 -0.271132 -0.229861 0.007770 -0.016950 -0.487183 -0.010998 -0.362140 0.067558 0.171979 0.179437 0.178071 0.126402 0.356499 0.187370 -0.367433 -0.477545 -0.860743 -0.848943 0.296566 -0.377360 -0.332033 -0.550688 -0.392427 -0.538073 0.258209 0.260858 0.249283 0.229585 0.217934 0.283744 0.266010 0.241057 0.242665 0.234819 0.236896 0.243848 0.242182 0.242873 0.228299 0.249036 0.236881 0.243244 0.217918 0.219594
chargesum: 0.00000
title: Mulliken charges with hydrogens summed into heavy atoms:
elementType: O O N N C C C C C C C C C C C C C C C C C C C C C
charge: -0.293078 -0.271132 -0.229861 0.007770 0.241259 0.022958 -0.010998 0.085379 0.067558 0.171979 0.179437 0.178071 0.126402 0.356499 0.187370 -0.083689 -0.211535 -0.142202 -0.126016 0.296566 -0.134487 -0.103734 -0.301652 -0.155546 0.142683
polarizability: 4.30013229e+02 -5.90252651e+00 2.88587821e+02 3.44541277e+00 6.87894386e+00 1.20081987e+02
1716.lowfreq: -5.9679 -0.9001 -0.0008 -0.0008 -0.0006 5.8883 35.8095 41.3792 69.3864
frequency: 35.7516 41.3623 69.3508 71.4407 80.5635 86.1013 112.5787 114.5807 130.3870 161.5403 170.7198 178.2186 198.6596 219.8960 238.6125 248.1317 274.2864 282.0096 290.9130 323.6558 324.7634 353.5480 363.1103 380.8207 413.7791 423.4999 440.0997 454.1929 471.5777 472.9982 496.3497 545.1037 571.6408 600.7587 610.0531 621.0285 638.0497 649.9424 680.1509 699.3054 725.5571 730.2769 762.0682 765.7362 807.9707 810.7001 814.5705 816.5297 827.5691 862.8357 882.3121 882.8875 913.5541 919.1037 937.8869 959.9739 969.2845 998.1780 1009.9524 1016.8183 1032.9461 1035.2842 1039.3405 1063.3665 1071.8041 1084.4339 1093.1324 1108.5468 1111.3287 1125.3796 1141.3085 1144.0709 1170.2372 1178.7018 1203.1782 1230.0675 1233.2809 1244.1990 1269.5862 1299.3634 1306.4124 1311.7947 1337.0561 1354.8831 1371.0998 1394.8164 1396.7306 1400.4933 1405.0280 1408.2228 1415.1363 1430.8305 1437.0029 1455.9018 1464.6953 1466.5076 1470.7186 1475.7321 1477.3285 1478.7676 1482.3435 1483.2154 1497.0904 1506.9183 1568.2751 1584.6880 1593.3776 1606.8702 1636.4693 2953.9813 2970.1112 2981.8120 2988.3309 3039.3777 3051.5549 3057.5260 3065.4884 3084.6760 3096.2881 3106.5292 3117.2818 3120.9502 3133.9005 3137.3840 3146.4246 3163.6362 3168.7903 3173.0697 3195.9788
redmass: 4.6354 4.1137 4.5791 3.9140 3.4752 3.8568 3.8709 3.0232 3.6080 1.3870 2.3059 2.6380 2.0574 2.5696 2.1023 2.0099 5.3929 2.7952 3.6278 3.1429 3.6444 3.7129 3.1012 5.3038 5.5856 3.2594 2.2925 4.0508 3.9883 4.7390 4.8474 4.8309 3.3896 4.8759 6.2227 3.6692 4.4777 4.5971 6.1383 4.8839 5.5997 5.6079 4.8905 4.2557 2.4463 1.5245 3.3308 4.8726 1.4391 2.9969 2.1913 1.6678 4.0378 1.5801 1.3210 1.4202 1.5687 3.8920 2.9367 2.7324 1.4940 1.4718 1.5669 2.4249 2.2380 2.1081 2.1346 1.6646 1.2602 1.6380 1.6424 1.9363 1.7373 1.9553 2.2302 2.5479 1.6713 2.0557 1.4883 1.7774 3.5037 1.8991 1.9659 3.1757 2.4436 2.1403 1.3186 1.9830 3.3550 1.8517 4.2121 1.7205 1.3797 1.3305 1.9549 1.0504 2.2671 2.1966 1.0528 1.1724 1.2736 1.4180 1.2775 1.0889 7.5060 6.8454 7.2705 7.9684 7.6202 1.0332 1.0446 1.0413 1.0690 1.1037 1.0972 1.0903 1.0536 1.0929 1.0946 1.0925 1.0944 1.0989 1.0866 1.0889 1.0897 1.0965 1.0947 1.1181 1.0914
irintensity: 0.6879 0.5249 5.8764 6.5883 0.6498 3.1682 0.4801 0.7063 0.2859 1.1414 3.5460 1.4906 0.4658 1.0866 0.8481 1.7560 0.2526 3.9025 5.0191 0.7159 1.3921 4.0145 3.3327 1.2093 5.5424 0.0280 5.4872 11.0136 4.7996 0.2820 0.6091 8.5720 1.4471 8.0761 11.8129 3.7412 2.4373 1.7311 6.1765 10.3187 2.4710 25.4226 4.5290 1.9768 17.6631 43.4611 4.7944 25.8775 43.4676 4.6667 3.1502 20.5026 7.5950 1.8253 2.6531 0.1152 34.1482 43.3642 18.2587 43.2416 3.5661 4.0022 1.8963 2.2749 1.6556 5.4646 0.6092 0.1033 0.1624 7.9509 28.7780 34.9806 68.0622 54.7958 107.8544 11.0039 24.2094 34.8370 32.6836 31.0611 54.0414 22.3083 85.6051 48.5896 17.1637 24.1048 8.4691 5.4713 21.5052 3.0519 14.8212 22.6592 23.4524 11.2027 188.0989 12.7124 19.9066 103.6758 12.0667 7.5591 17.9917 68.6339 71.6742 13.3969 16.6388 16.4352 59.5504 79.5949 15.4624 94.7299 43.5823 17.6638 35.1691 51.8233 13.5316 19.2246 32.6258 8.7919 14.3430 10.1870 12.4592 28.7772 11.8863 27.8620 3.7772 41.2255 10.7152 24.5171 3.5123
temp: 298.150 k
press: 1.00000 atm
elementType: 8 8 7 7 6 6 6 6 6 6 6 6 6 6 6 6 6 6 6 6 6 6 6 6 6 1 1 1 1 1 1 1 1 1 1 1 1 1 1 1 1 1 1 1 1
symmnumber: 1
zpe: 943879.6 jmol-1
zpe.correction: 0.359505 hartree
zpe.thermalcorrener: 0.381390 hartree
zpe.thermalcorrenthalpy: 0.382334 hartree
zpe.thermalcorrgfe: 0.309044 hartree
zpe.sumelectzpe: -1070.377704 hartree
zpe.sumelectthermal: -1070.355819 hartree
zpe.sumelectthermalent: -1070.354874 hartree
zpe.sumelectthermalfe: -1070.428165 hartree
dipole: 3.7616 4.7388 1.1280
dipole: 6.1545
quadrupole: -155.0488 -125.1319 -150.0848
quadrupole: -18.2159 3.6814 4.3856
quadrupole: -11.6270 18.2899 -6.6630 -18.2159 3.6814 4.3856
hfenergy: -1070.7372088 hartree
pointgroup: C01 [X(C21H20N2O2)]
dipole: 1.3581515 -1.9576351 -0.431457 debye
polarizability: 430.0341565|-4.3805643|288.2166172|6.4354715|9.4530151|120.4322633 unknown
InChI: InChI=1S/C21H20N2O2/c1-12-18-9-22-7-6-16(18)13(2)21-20(12)17-8-14(24-3)4-5-19(17)23(21)10-15-11-25-15/h4-9,15H,10-11H2,1-3H3
charge 0 multiplicity 1
45 atoms
O  2.602258 -3.902813 0.549352
O  4.264601 2.804825 0.218365
N  0.510616 -1.333484 -0.195346
N  -5.115706 1.998067 -0.124728
C  1.110298 -3.71333 0.357277
C  0.694736 -2.700218 -0.701347
C  -0.694061 -0.590612 -0.125331
C  1.757402 -5.001983 -0.046401
C  -0.348266 0.822474 -0.019756
C  1.60676 -0.437249 -0.089677
C  1.115486 0.905327 0.016678
C  -2.026115 -1.04407 -0.09833
C  -1.338007 1.818055 0.036575
C  -3.045999 -0.027921 -0.105814
C  -2.713171 1.393171 -0.047264
C  2.980213 -0.734092 -0.089104
C  2.040191 1.967461 0.11774
C  -2.418019 -2.510928 0.011058
C  -0.93371 3.273792 0.178528
C  3.425597 1.676508 0.110875
C  3.895717 0.339581 0.009221
C  -4.445252 -0.35568 -0.171579
C  -3.81034 2.326048 -0.061589
C  -5.412983 0.64634 -0.179031
C  5.708043 2.571298 0.240208
H  0.562955 -3.671737 1.307952
H  -0.237868 -3.031025 -1.184966
H  1.477792 -2.684941 -1.485677
H  1.638273 -5.889506 0.585821
H  1.946085 -5.196831 -1.110564
H  3.340003 -1.76692 -0.12574
H  1.737917 3.012446 0.200079
H  -1.629313 -3.107572 0.49647
H  -3.320322 -2.623408 0.635937
H  -2.645593 -2.975307 -0.96921
H  -1.790043 3.957977 0.257042
H  -0.314827 3.416844 1.083914
H  -0.325105 3.600728 -0.685762
H  4.967234 0.120912 0.01965
H  -4.768692 -1.398131 -0.238319
H  -3.611259 3.401847 -0.026682
H  -6.479311 0.4022 -0.236514
H  6.159811 3.57011 0.332695
H  6.055808 2.091574 -0.696142
H  6.004767 1.947372 1.106436
