program: Gaussian 09
title: 000289119
version: EM64L-G09RevD.01
frameworkgroup: C1[X(C11H10BrNS)]
method: RPBEPBE
basis: SDD
operation: Freq
keyword: #p
keyword: freq=noraman
keyword: PBEPBE/SDD
title: #p freq=noraman PBEPBE/SDD
converged: YES YES NO NO
title: Mulliken charges:
elementType: Br S N C C C C C C C C C C C H H H H H H H H H H
charge: -0.020199 0.174602 -0.472929 0.161272 0.251692 -0.445531 0.174303 -0.808302 0.219135 -0.696959 -0.356490 -0.347883 -0.231786 -0.174835 0.251039 0.217121 0.271720 0.262633 0.304368 0.262270 0.268732 0.253713 0.237025 0.245290
chargesum: 0.00000
title: Mulliken charges with hydrogens summed into heavy atoms:
elementType: Br S N C C C C C C C C C C C
charge: -0.020199 0.174602 -0.168562 0.161272 0.251692 0.022629 0.174303 -0.273949 0.219135 -0.165957 -0.102777 -0.110858 -0.231786 0.070455
polarizability: 2.47269611e+02 1.11383805e+01 1.53304758e+02 2.54892513e-01 8.90334550e-01 7.33416570e+01
1716.lowfreq: -10.4570 -7.2947 0.0016 0.0018 0.0021 3.3370 51.6178 74.5306 102.0322
frequency: 51.6024 74.5292 102.0245 158.9925 162.9016 236.4428 245.5020 252.3634 303.7851 326.1574 343.7564 413.1293 428.6955 485.2245 502.0047 541.7150 582.8222 611.1593 630.1758 635.9011 668.9135 696.7498 742.6473 752.4981 793.8490 828.1022 852.2993 872.3380 889.8541 931.9633 946.4689 988.7573 1017.9057 1043.8484 1126.0125 1137.3066 1153.6997 1164.7106 1180.6074 1214.2353 1234.6873 1249.1649 1279.9655 1288.2741 1297.3509 1348.7023 1402.9838 1428.5539 1437.9662 1443.5089 1449.6971 1453.5084 1469.0233 1568.0572 1595.1007 1629.1512 2956.3032 2995.5900 3005.5595 3029.8047 3057.7910 3104.9313 3140.1973 3162.3803 3173.9906 3605.0412
redmass: 4.2042 5.0873 10.6020 3.8955 3.2438 5.2752 3.6101 4.2564 4.7543 4.5686 5.3817 3.3704 3.3432 4.5905 1.2028 4.3014 3.5271 4.7155 5.1781 5.9955 4.2866 5.0325 3.7978 5.1463 1.4925 2.7152 2.0445 1.6575 1.8998 1.3356 2.8181 2.0734 2.4076 2.1356 1.7943 1.1545 2.3793 1.1728 1.3117 1.4105 1.6048 1.3766 1.9310 1.3723 1.9701 2.1098 3.8135 2.4505 1.1932 1.7561 1.2192 1.6662 5.0245 7.2308 7.2666 6.7215 1.0600 1.0593 1.0950 1.0632 1.1033 1.1062 1.0898 1.0926 1.0957 1.0805
irintensity: 0.5521 1.7816 0.0114 1.5133 4.7326 1.5131 0.0658 1.7207 1.1339 1.8491 0.0449 3.8148 5.7611 2.8417 82.9903 8.4446 24.9656 2.0165 13.7798 17.8520 1.9070 1.7582 1.7214 10.9737 52.0698 3.8583 3.5596 25.0414 8.9200 0.6632 34.3140 10.6143 4.2809 16.7644 9.8388 0.3723 3.1971 5.9168 7.5731 20.2114 6.3935 6.1608 8.5681 4.8214 11.7080 26.8441 33.7487 37.6105 9.5726 1.8209 2.4295 2.0526 83.6407 18.2439 33.0803 1.2614 50.4918 26.4092 9.5264 43.6339 6.6639 15.0673 8.3276 2.3073 5.7111 53.8910
temp: 298.150 k
press: 1.00000 atm
elementType: 35 16 7 6 6 6 6 6 6 6 6 6 6 6 1 1 1 1 1 1 1 1 1 1
symmnumber: 1
zpe: 477901.8 jmol-1
zpe.correction: 0.182023 hartree
zpe.thermalcorrener: 0.194149 hartree
zpe.thermalcorrenthalpy: 0.195093 hartree
zpe.thermalcorrgfe: 0.142324 hartree
zpe.sumelectzpe: -890.465349 hartree
zpe.sumelectthermal: -890.453223 hartree
zpe.sumelectthermalent: -890.452279 hartree
zpe.sumelectthermalfe: -890.505048 hartree
dipole: 3.3138 3.9547 0.8220
dipole: 5.2246
quadrupole: -99.7981 -86.0027 -103.0070
quadrupole: 9.5882 3.9370 -1.6493
quadrupole: -3.5288 10.2666 -6.7377 9.5882 3.9370 -1.6493
hfenergy: -890.6473721 hartree
pointgroup: C01 [X(C11H10Br1N1S1)]
dipole: 1.11752 1.6944206 0.324462 debye
dipolederiv: -0.5804071 -0.2724475 0.012494 -0.373967 -0.2910112 0.0108136 0.016248 0.0094158 -0.0586475 -0.1693407 -0.0019649 -0.0497599 0.0221855 -0.2144923 0.0665086 -0.0814076 0.0325019 -0.1140534 -0.6719699 0.0993139 -0.0168263 -0.1606272 -0.5537493 0.0166034 0.006468 0.0242804 -0.2763224 -0.376988 -0.1852385 0.0361389 -0.2944091 -0.0780677 0.0142648 0.0884416 -0.0181424 -0.1541307 0.2082162 -0.2180793 -0.0076717 0.0068003 0.5219124 -0.0227222 -0.1362981 -0.0220984 -0.0360029 0.037192 0.0804846 -0.0389606 0.0460259 -0.0225129 0.0228963 0.0600431 0.0001044 0.1315686 0.4008209 0.0866948 -0.0041795 -0.1995718 -0.1501797 -0.0002778 0.0283273 -0.0044186 0.0190882 0.3218093 -0.0450987 -0.0495266 -0.0055523 0.1103084 -0.0667415 -0.0281177 -0.0256274 0.1699404 0.2066897 0.2012124 0.0000303 0.7065438 0.0596139 0.0035733 -0.03995 -0.0028749 0.0444497 0.0630236 0.0468838 0.0554035 -0.0874442 0.2607222 0.0653417 0.0740457 0.0452319 0.1432051 -0.2419667 -0.0874931 0.0017536 -0.1828779 -0.0750928 -0.0075787 0.004105 -0.0001638 -0.1183314 0.2308303 -0.0323222 -0.0030321 -0.0758941 0.0380349 -0.0112511 0.0053946 -0.0104559 -0.1810599 0.8754595 0.5392385 -0.021721 0.7425203 0.4550498 -0.0277909 -0.030351 -0.0245585 -0.1367647 -0.405622 -0.1904049 0.0105236 -0.2134949 -0.1067813 0.0020058 0.0080761 -0.001086 -0.1342419 -0.0822045 -0.0440727 0.0359341 -0.015297 0.0686248 0.0368892 0.0853198 0.0891944 -0.0761358 -0.0014499 0.0189417 -0.0019774 -0.0521183 -0.1502964 -0.104637 -0.0779663 -0.1136415 0.0374243 -0.0538643 0.0232293 0.0418595 0.0607062 -0.0095249 0.0543281 0.0348177 0.1142298 -0.0800684 -0.0008225 -0.0764796 -0.0461842 -0.0000638 -0.0178587 -0.0516347 -0.0043117 -0.0860964 0.0403488 0.1568456 0.0004002 -0.0023622 0.0247208 0.1958216 0.0049818 -0.0025141 -0.0043969 0.3235006 -0.1475875 -0.0279809 -0.0005626 -0.0353568 0.0518324 -0.0111838 0.025972 -0.0059392 0.1003722 0.1111712 -0.001184 0.0531726 0.0031909 -0.0211516 -0.0199182 -0.032932 -0.018168 -0.1437639 0.1148885 0.0380508 -0.0027387 0.0105366 -0.0419278 0.0098089 -0.0005095 0.0066893 0.1572067 0.0512005 -0.0151821 0.0009242 0.0248199 -0.1106012 0.0121345 -0.0001537 0.0119844 0.1753049 -0.0459245 0.0634986 -0.0027318 0.0486242 0.0813272 0.003586 -0.0027473 0.0040357 0.1671136 unknown
polarizability: 243.3324519|21.8294565|157.1714503|-2.5262753|1.5409275|73.4121234 unknown
InChI: InChI=1S/C11H10BrNS/c12-7-1-2-10-8(5-7)9-6-14-4-3-11(9)13-10/h1-2,5,13H,3-4,6H2
charge 0 multiplicity 1
24 atoms
Br -4.46723 -1.68233 0.077282
S  3.472709 -1.670908 -0.450755
N  0.576097 1.789627 -0.067014
C  0.95204 -0.460558 0.025925
C  1.567721 0.792596 -0.026039
C  3.038126 1.116799 -0.053444
C  -0.481492 -0.231866 0.020832
C  1.653059 -1.790693 0.078828
C  -0.689113 1.192699 -0.040485
C  3.877831 -0.065965 0.468501
C  -1.606862 -1.097538 0.056867
C  -1.977933 1.764168 -0.064348
C  -2.881656 -0.510546 0.030662
C  -3.08843 0.894518 -0.028231
H  3.35823 1.36307 -1.085852
H  3.248195 2.010326 0.572111
H  1.622253 -2.23682 1.089864
H  1.204993 -2.512708 -0.626868
H  0.758374 2.790224 -0.105765
H  4.954154 0.098397 0.298386
H  3.706246 -0.23485 1.545338
H  -1.488856 -2.183883 0.103968
H  -2.130994 2.847586 -0.11113
H  -4.104859 1.297054 -0.046336
