program: Gaussian 09
title: 000289147
version: EM64L-G09RevD.01
frameworkgroup: C1[X(C20H18O2S)]
method: RPBEPBE
basis: SDD
operation: Freq
keyword: #p
keyword: freq=noraman
keyword: PBEPBE/SDD
title: #p freq=noraman PBEPBE/SDD
converged: YES YES NO NO
title: Mulliken charges:
elementType: S O O C C C C C C C C C C C C C C C C C C C C H H H H H H H H H H H H H H H H H H
charge: 0.762315 -0.406812 -0.573535 -0.446020 0.496952 0.442388 -0.400533 -0.412876 -0.362350 -0.363301 -0.188881 -0.233545 -0.226088 -0.234653 -0.230933 -0.239393 -0.246100 -0.186675 -0.220157 0.454071 -0.355662 -0.376396 -0.802087 0.289803 0.250984 0.236623 0.251003 0.258601 0.225329 0.223871 0.223946 0.223058 0.226951 0.224946 0.287071 0.251576 0.238242 0.238140 0.226679 0.230120 0.243330
chargesum: 0.00000
title: Mulliken charges with hydrogens summed into heavy atoms:
elementType: S O O C C C C C C C C C C C C C C C C C C C C
charge: 0.762315 -0.406812 -0.573535 -0.156217 0.496952 0.442388 -0.149549 -0.176253 -0.111346 -0.104700 -0.188881 -0.008216 -0.002217 -0.010707 -0.007875 -0.012442 -0.021154 0.100396 0.031418 0.454071 -0.117420 -0.138256 -0.101959
polarizability: 3.23953319e+02 -3.46119354e+01 2.13927410e+02 3.43155022e+00 -1.27836131e+01 1.90171552e+02
1716.lowfreq: -6.9491 -0.0018 -0.0016 -0.0015 4.0152 5.7558 13.8186 14.6040 30.5389
frequency: 13.1407 14.2481 30.4851 33.0197 41.6797 48.9681 55.2560 62.7265 82.9401 121.1493 158.4145 174.9510 204.0766 227.7465 257.6021 274.1273 280.4823 309.3407 343.0898 350.8123 395.4132 402.0982 404.2801 405.8284 446.7879 450.3981 479.4197 502.6051 562.0111 587.1464 595.7188 615.3151 615.9739 625.4452 655.6104 704.1941 706.3172 710.8869 749.0811 770.8228 780.8102 816.3809 828.1316 847.3621 851.5620 855.7444 857.0065 858.8502 895.6001 929.2747 937.8339 955.4246 979.2126 982.2183 987.9733 989.8510 990.5353 990.9298 994.1742 996.5099 997.5161 1025.7437 1027.1857 1047.4923 1050.4984 1078.8342 1083.7335 1117.7226 1169.8902 1171.2345 1179.6246 1183.4602 1184.8647 1189.5827 1218.7520 1219.6558 1271.7380 1295.8753 1306.5126 1333.9695 1345.8631 1377.8656 1382.7337 1389.8731 1396.7344 1399.8386 1436.7533 1442.3377 1470.9969 1475.1355 1475.9348 1480.0094 1482.3202 1589.1255 1591.9813 1594.4021 1599.5823 1609.5727 1613.1538 2886.2154 2979.0929 3061.2510 3090.7107 3115.7307 3118.6731 3123.0698 3125.5274 3126.3263 3128.4840 3136.8413 3138.0369 3146.5751 3148.7411 3149.8147 3150.3657 3161.9265 3162.6935
redmass: 4.8863 5.0920 4.3753 3.8507 3.8605 1.0729 4.4719 5.1231 5.7653 4.5345 7.0666 7.2785 5.2603 4.3131 5.4516 7.6858 4.9717 5.3571 7.2756 3.6485 6.3154 2.8192 2.9830 2.9059 7.6472 4.9573 3.6401 3.1493 4.3767 5.6752 6.0287 6.4538 6.2678 6.9668 5.5700 1.7104 1.7793 3.2471 2.0408 1.9603 4.7908 1.3597 4.6657 3.6773 1.5011 1.2991 2.8034 1.4356 4.0884 1.5710 1.6524 1.3306 1.3865 1.4062 1.3628 5.8183 5.7507 1.3878 1.3298 1.3173 4.9887 2.2614 2.1212 1.6379 2.4402 1.5878 1.5884 1.2826 1.0658 1.0587 2.0849 1.2737 1.1686 1.1424 2.1889 2.8026 1.6458 1.2777 1.3335 1.2216 1.3284 4.6500 6.6606 6.0258 3.5592 1.2300 2.1903 2.1355 1.0858 1.0675 2.3903 2.2591 2.3098 6.7055 6.2287 6.0227 6.0652 5.9776 6.1125 1.0815 1.0389 1.0949 1.0999 1.0857 1.0857 1.0873 1.0875 1.0875 1.0878 1.0923 1.0921 1.0962 1.0957 1.0976 1.0954 1.1009 1.1013
irintensity: 0.4427 0.5658 0.3823 0.4204 0.0396 0.4791 0.3676 0.6432 2.1570 0.3806 4.6510 4.8051 3.3405 3.4735 9.5516 1.4719 1.1962 1.4784 22.6785 6.4808 4.9148 0.3877 0.3506 0.4476 38.3603 9.2216 2.3797 54.5437 6.2116 9.0676 22.7324 0.0535 3.5399 0.6088 19.8862 56.7275 54.1835 1.9811 33.6516 65.9677 0.4943 43.3742 13.4718 22.3939 15.5808 0.3814 14.2536 5.4377 56.8263 2.8427 4.1491 1.3568 0.3427 0.0587 1.7107 0.2042 1.0334 0.6578 0.3714 0.5852 1.6645 2.0159 12.0471 19.5523 23.5064 2.9996 11.2234 10.2021 0.3144 0.0941 7.9506 1.7014 7.0685 4.0196 5.0529 10.6279 4.8330 2.5440 5.2704 0.6101 4.1216 0.1146 1.1196 1.0632 7.3175 17.4312 11.8027 13.7747 13.9867 12.5204 15.3747 5.9968 19.5269 0.0332 1.8927 0.5404 19.6677 3.2476 1.9324 11.5574 25.0698 22.4869 15.3798 3.4534 2.5040 1.5735 0.5483 6.0607 8.1889 21.6899 17.4861 8.8528 32.9351 16.1672 25.8224 27.6360 27.6744
temp: 298.150 k
press: 1.00000 atm
elementType: 16 8 8 6 6 6 6 6 6 6 6 6 6 6 6 6 6 6 6 6 6 6 6 1 1 1 1 1 1 1 1 1 1 1 1 1 1 1 1 1 1
symmnumber: 1
zpe: 837704.0 jmol-1
zpe.correction: 0.319065 hartree
zpe.thermalcorrener: 0.340482 hartree
zpe.thermalcorrenthalpy: 0.341426 hartree
zpe.thermalcorrgfe: 0.264005 hartree
zpe.sumelectzpe: -1319.732264 hartree
zpe.sumelectthermal: -1319.710847 hartree
zpe.sumelectthermalent: -1319.709903 hartree
zpe.sumelectthermalfe: -1319.787324 hartree
dipole: -3.6217 2.1757 -1.0541
dipole: 4.3545
quadrupole: -119.4132 -140.7679 -136.6424
quadrupole: -4.3616 2.9601 3.2003
quadrupole: 12.8613 -8.4934 -4.3679 -4.3616 2.9601 3.2003
hfenergy: -1320.0513288 hartree
pointgroup: C01 [X(C20H18O2S1)]
dipole: -0.9304187 1.2832612 -0.6500405 debye
polarizability: 270.4592741|-67.5974056|257.9083429|3.5834165|-21.434506|199.6846647 unknown
InChI: InChI=1S/C20H18O2S/c1-16-12-14-19(15-13-16)23(21)22-20(17-8-4-2-5-9-17)18-10-6-3-7-11-18/h2-15,20H,1H3
charge 0 multiplicity 1
41 atoms
S  -1.667671 -2.240062 0.584169
O  -0.114885 -1.844733 -0.512678
O  -1.142492 -2.055831 2.136352
C  0.878951 -1.037927 0.236371
C  2.227297 -1.722791 -0.005066
C  0.819252 0.436599 -0.151611
C  2.562218 -2.862051 0.771327
C  1.27181 1.416548 0.76661
C  3.128395 -1.278103 -1.002763
C  0.35055 0.849682 -1.422313
C  -2.655891 -0.667361 0.279362
C  3.777334 -3.545307 0.554875
C  1.259692 2.786207 0.421462
C  4.345426 -1.962942 -1.221483
C  0.335633 2.219358 -1.769678
C  4.67365 -3.097605 -0.4453
C  0.79156 3.192637 -0.850237
C  -2.767542 0.273374 1.317626
C  -3.273915 -0.482522 -0.971915
C  -4.148846 1.677348 -0.166297
C  -3.516152 1.445503 1.084584
C  -4.022079 0.695771 -1.185112
C  -4.920822 2.95984 -0.415016
H  0.63756 -1.13868 1.322195
H  1.860984 -3.211475 1.539298
H  1.634727 1.106509 1.754581
H  2.885059 -0.391533 -1.598283
H  -0.015613 0.091236 -2.122461
H  4.027246 -4.422377 1.162577
H  1.610853 3.533864 1.141916
H  5.037313 -1.609592 -1.994567
H  -0.030886 2.526887 -2.755983
H  5.618495 -3.626574 -0.614551
H  0.780855 4.255047 -1.119607
H  -2.272095 0.077608 2.275617
H  -3.173029 -1.228403 -1.768497
H  -3.610687 2.191513 1.882411
H  -4.509444 0.856231 -2.153904
H  -5.660988 2.840707 -1.224898
H  -5.454273 3.29497 0.491912
H  -4.234652 3.777036 -0.711026
