program: Gaussian 09
title: 000289112
version: EM64L-G09RevD.01
frameworkgroup: C1[X(C16H13NS)]
method: RPBEPBE
basis: SDD
operation: Freq
keyword: #p
keyword: freq=noraman
keyword: PBEPBE/SDD
title: #p freq=noraman PBEPBE/SDD
converged: YES YES NO NO
title: Mulliken charges:
elementType: S N C C C C C C C C C C C C C C C C H H H H H H H H H H H H H
charge: 0.196267 -0.488299 0.206264 0.148871 0.180975 0.535881 0.197285 -0.820598 -0.444437 -0.581464 -0.421570 -0.363129 0.446450 -0.261249 -0.381044 -0.251974 -0.222156 -0.816550 0.281481 0.258823 0.312660 0.216845 0.231810 0.231551 0.243695 0.233996 0.221392 0.221992 0.229974 0.234068 0.222190
chargesum: 0.00000
title: Mulliken charges with hydrogens summed into heavy atoms:
elementType: S N C C C C C C C C C C C C C C C C
charge: 0.196267 -0.175639 0.206264 0.148871 0.180975 0.535881 0.197285 -0.280294 -0.444437 -0.364619 -0.189760 -0.131578 0.446450 -0.017553 -0.147048 -0.030582 -0.000164 -0.130318
polarizability: 3.48402989e+02 6.84054407e+00 2.06761843e+02 4.03119261e+00 3.25320101e+00 8.82625470e+01
1716.lowfreq: -11.5043 -0.0013 -0.0008 -0.0007 4.8672 10.5136 12.0725 56.1419 65.6425
frequency: -6.7709 56.1339 65.6276 106.6122 127.0845 170.6618 179.5824 239.0039 273.7452 291.4050 311.8707 330.2972 357.6614 366.3710 423.6633 430.1292 457.2572 509.7354 521.7415 549.9426 570.0134 572.8854 592.0895 614.9524 667.7578 670.8895 695.6862 743.4135 748.5973 751.0193 761.8048 779.0520 821.4006 848.1866 863.3194 886.3478 892.8490 929.0514 938.6445 954.8265 970.0221 996.3949 1011.0282 1023.8919 1047.4149 1072.2937 1112.5994 1137.6451 1151.7893 1166.8306 1174.3251 1219.8165 1229.4138 1244.4485 1263.7165 1279.5315 1323.5200 1351.3718 1365.4820 1383.5524 1399.7350 1415.0073 1432.0114 1449.1010 1464.2531 1469.5582 1473.9104 1482.3948 1492.2473 1565.5872 1575.9586 1587.0353 1610.6510 1630.7551 2975.4788 3003.1212 3054.5157 3080.1798 3082.0384 3108.0034 3123.9864 3124.2616 3130.9728 3144.9937 3149.3794 3163.0862 3609.3408
redmass: 1.0226 5.0424 3.8902 4.7497 4.5961 2.7017 4.7130 4.4955 4.8484 4.0653 4.5462 4.2734 7.5599 7.1720 3.1622 3.9055 3.1193 1.1762 4.1448 3.9983 6.8842 3.6697 5.8602 5.7035 5.3319 6.4332 5.3209 2.0253 3.6762 2.4640 3.5541 5.2300 1.3204 1.4722 4.0675 1.6440 2.1515 1.4053 2.4105 1.3514 1.3056 1.5865 2.0135 4.8698 1.5443 3.0605 1.7889 1.6647 1.1986 1.1574 1.7945 1.8706 1.6350 1.4540 1.7200 1.5781 2.6324 2.2926 7.0482 3.1536 1.2342 3.3683 3.1801 1.1477 3.9503 1.0669 1.2652 2.9120 3.0930 6.5640 7.2236 6.2739 6.2956 7.0501 1.0376 1.0617 1.0969 1.1018 1.0990 1.0903 1.0849 1.0878 1.0891 1.0952 1.0965 1.1001 1.0801
irintensity: 0.4584 0.3875 0.3631 0.0511 0.7155 2.9470 0.1084 0.6446 0.4771 4.8689 0.6739 0.3856 2.2837 1.6048 4.4714 0.7361 9.2972 94.4310 7.2767 1.2314 4.3055 1.5095 1.7509 2.9822 7.6738 1.2390 2.0095 44.8120 6.2589 43.3754 19.3078 4.0203 38.8634 0.0424 1.7259 4.0401 4.0430 3.1377 1.7360 0.7678 0.0459 2.8115 12.9559 26.8068 13.8507 7.4844 3.0148 11.9814 0.7528 2.9982 2.2601 6.2601 6.4657 4.6005 2.5262 7.5132 18.3680 18.9129 33.2739 16.3474 10.9327 16.6444 13.7468 2.5382 35.4999 13.9750 26.5569 5.0023 19.1815 0.8123 1.5594 3.6428 16.0928 0.7567 48.3257 36.2149 21.2015 5.9458 15.8182 21.6802 1.8235 8.8263 1.6256 32.5482 18.5381 41.2107 37.9321
temp: 298.150 k
press: 1.00000 atm
elementType: 16 7 6 6 6 6 6 6 6 6 6 6 6 6 6 6 6 6 1 1 1 1 1 1 1 1 1 1 1 1 1
symmnumber: 1
zpe: 636377.2 jmol-1
zpe.correction: 0.242383 hartree
zpe.thermalcorrener: 0.256193 hartree
zpe.thermalcorrenthalpy: 0.257137 hartree
zpe.thermalcorrgfe: 0.201841 hartree
zpe.sumelectzpe: -1069.112055 hartree
zpe.sumelectthermal: -1069.098245 hartree
zpe.sumelectthermalent: -1069.097301 hartree
zpe.sumelectthermalfe: -1069.152597 hartree
dipole: -0.7957 -2.5330 0.4359
dipole: 2.6906
quadrupole: -99.8075 -99.9524 -118.9750
quadrupole: 4.8414 0.1947 4.1345
quadrupole: 6.4375 6.2926 -12.7300 4.8414 0.1947 4.1345
hfenergy: -1069.3544383 hartree
pointgroup: C01 [X(C16H13N1S1)]
dipole: -0.3165812 0.9898468 -0.2013206 debye
polarizability: 348.3840047|-6.6286192|206.8161969|-5.2858856|-0.4929359|88.227177 unknown
InChI: InChI=1S/C16H13NS/c1-10-6-7-15-12(8-10)16-13(9-18-15)11-4-2-3-5-14(11)17-16/h2-8,17H,9H2,1H3
charge 0 multiplicity 1
31 atoms
S  -1.125181 -2.76611 0.474105
N  0.79162 1.289089 0.147277
C  0.928902 -0.963212 -0.194488
C  0.042497 0.109984 -0.025026
C  2.27302 -0.43704 -0.12163
C  -1.416472 0.047386 -0.008262
C  2.156291 0.984783 0.100194
C  0.477746 -2.36576 -0.475736
C  -2.062761 -1.211316 0.194015
C  -2.228249 1.204969 -0.171728
C  3.567638 -1.01431 -0.222226
C  3.28465 1.821113 0.236849
C  -3.63836 1.15644 -0.100904
C  -3.472131 -1.274281 0.257616
C  -4.250197 -0.10521 0.123089
C  4.695711 -0.182459 -0.088672
C  4.556534 1.219328 0.139767
C  -4.47948 2.41134 -0.257673
H  0.279316 -2.544064 -1.547816
H  1.203744 -3.115951 -0.12046
H  0.399361 2.19779 0.382785
H  -1.746856 2.169214 -0.382503
H  3.6904 -2.08915 -0.397174
H  3.184519 2.898549 0.409532
H  -3.961866 -2.24261 0.407386
H  -5.343202 -0.177008 0.175798
H  5.700343 -0.613762 -0.159845
H  5.454667 1.83874 0.240324
H  -5.297498 2.260364 -0.985896
H  -4.948826 2.701453 0.70199
H  -3.873782 3.266701 -0.603987
