program: Gaussian 09
title: 000289171
version: EM64L-G09RevD.01
frameworkgroup: C1[X(C22H20O7)]
method: RPBEPBE
basis: SDD
operation: Freq
keyword: #pfreq=noraman
keyword: PBEPBE/SDD
title: #p freq=noraman PBEPBE/SDD
converged: YES YES NO NO
title: Mulliken charges:
elementType: O O O O O O O C C C C C C C C C C C C C C C C C C C C C C H H H H H H H H H H H H H H H H H H H H
charge: -0.245670 -0.237401 -0.197305 -0.248033 -0.246954 -0.272690 -0.280595 0.138818 0.109873 0.095548 0.130041 -0.430238 -0.471133 0.445822 0.400081 0.191184 0.184957 -0.367726 -0.333558 -0.437906 -0.407342 -0.220247 -0.228917 -0.220070 -0.219487 -0.239528 -0.234346 -0.498516 -0.498243 0.288531 0.220408 0.230842 0.277932 0.265265 0.256459 0.237159 0.249948 0.226255 0.230507 0.226711 0.227289 0.228222 0.229241 0.239688 0.240414 0.242644 0.240458 0.238826 0.242782
chargesum: 0.00000
title: Mulliken charges with hydrogens summed into heavy atoms:
elementType: O O O O O O O C C C C C C C C C C C C C C C C C C C C C C
charge: -0.245670 -0.237401 -0.197305 -0.248033 -0.246954 -0.272690 -0.280595 0.138818 0.109873 0.095548 0.130041 0.078701 0.037642 0.445822 0.400081 0.191184 0.184957 -0.102460 -0.077100 -0.200747 -0.157394 0.006007 0.001590 0.006642 0.007802 -0.011306 -0.005106 0.224230 0.223824
polarizability: 3.43394259e+02 -1.69289604e+01 2.62814404e+02 2.58555703e+01 3.00566126e+01 2.04807678e+02
1716.lowfreq: -8.7930 -5.1633 -2.3303 -0.0007 -0.0006 -0.0004 9.1936 12.4222 19.3364
frequency: 7.7596 12.0857 19.1702 20.8070 25.6213 33.6205 38.9393 65.3379 68.0704 72.4112 88.5288 98.2028 100.4040 106.3285 130.3613 137.5879 142.4068 163.9130 169.3897 189.4484 222.1994 234.1864 249.2378 283.7723 298.8113 307.8063 330.7188 344.9089 359.1668 385.2445 399.0068 402.1126 402.9807 419.6798 471.4422 476.4219 485.2282 564.9915 582.5048 595.2881 615.2245 615.6544 634.2848 672.2493 695.2646 701.6842 704.2514 710.2544 723.9912 733.7256 739.9046 745.9684 753.1774 785.2806 809.5047 822.7108 857.9834 859.4082 872.7663 890.3309 911.0848 917.0350 926.3880 967.3382 981.1601 983.5364 989.4678 989.8289 990.5356 996.0541 1002.3752 1004.3469 1026.6183 1027.1336 1041.7067 1086.2084 1089.8999 1105.2511 1111.2196 1113.6553 1126.3728 1140.9435 1148.9037 1152.6967 1172.4735 1173.6114 1188.2964 1189.3001 1197.9518 1214.9270 1224.3772 1227.6196 1253.3643 1294.7403 1315.6565 1324.7467 1343.8677 1362.4134 1384.3523 1388.6399 1412.1068 1423.7244 1434.8521 1440.3208 1446.5817 1452.0743 1452.8526 1461.3179 1461.6716 1473.2074 1476.4767 1485.5510 1487.1095 1540.3408 1556.5559 1585.0362 1594.2361 1595.3528 1602.9684 1614.5012 1617.7540 2966.6854 3003.5449 3004.2340 3036.3949 3077.4415 3104.3702 3105.0193 3106.8679 3119.6333 3123.2965 3127.4931 3128.6409 3138.7370 3140.6319 3149.6982 3152.4409 3152.6725 3153.4833 3164.7658 3165.2481
redmass: 5.0674 5.0189 4.2886 5.3606 4.3122 4.7737 4.3236 3.9359 4.0256 2.9839 1.6030 1.4955 2.8769 3.3295 4.7660 4.1078 4.3010 5.3400 5.9879 5.9766 5.8212 3.5246 7.7673 4.4092 4.3050 7.5516 4.2032 3.1808 8.6198 5.7579 5.6674 2.8337 2.8519 6.5002 3.4624 3.7708 8.3356 9.1873 6.2666 6.0240 6.3066 6.3943 7.3268 10.1764 7.3126 2.8413 2.0594 3.8064 10.1629 6.1250 8.8274 1.6536 1.8784 6.1455 3.8429 4.0810 1.2518 1.2807 7.2252 8.3616 2.1792 2.5274 1.3963 8.4082 1.4017 1.3912 3.0264 5.3694 2.1311 1.5492 1.4851 1.6061 2.2140 2.1939 7.1087 1.5670 1.5522 7.1144 1.2671 1.2615 4.6423 4.6289 1.6207 1.9337 1.0543 1.0559 1.1139 1.1170 1.1187 2.2580 2.3810 1.3676 6.0822 4.0026 1.4077 1.3661 1.4520 1.6699 7.6625 4.6409 1.5961 1.2374 2.0259 2.0971 2.4115 1.0505 1.0500 1.0551 1.0553 1.2967 1.1860 2.0646 2.0587 8.6641 9.4667 8.4287 6.3058 6.2646 9.0038 5.9559 6.0057 1.0656 1.0298 1.0298 1.0579 1.0971 1.1045 1.1045 1.1086 1.0858 1.0848 1.0877 1.0879 1.0924 1.0925 1.0967 1.1044 1.1044 1.0960 1.1016 1.1012
irintensity: 0.0405 0.3650 0.3103 0.4345 0.1325 0.7684 0.5540 0.9319 2.3963 1.6879 0.4920 0.1646 0.5974 0.1529 1.2637 1.4179 0.6708 10.8009 5.9801 5.6440 2.2833 1.4203 2.0809 24.0184 9.0546 3.2064 7.9805 9.1119 1.1302 6.3786 13.4689 1.1378 1.9381 5.6326 8.0144 6.8368 7.1378 10.3245 21.1678 6.0322 1.6735 0.1270 8.9677 2.2110 2.7465 18.7258 75.9199 12.2822 10.8244 2.3481 0.6473 86.8206 48.0376 8.9618 2.4022 4.2152 0.2081 2.5090 14.9081 67.8089 46.3442 22.8926 2.1193 100.9779 1.3203 0.6031 2.9117 0.7012 7.3508 3.4431 8.0869 11.6540 11.6188 25.8278 458.5626 9.4107 0.8800 123.9499 0.5421 0.2859 21.2011 94.1569 69.5208 20.3856 0.5101 0.1044 5.9396 2.8667 75.2592 25.5525 20.5115 28.5576 322.6242 285.8352 22.0782 29.1881 26.1681 25.5840 3.5853 5.7986 4.7120 93.0505 8.3426 3.5238 3.0392 10.2357 18.3612 11.9826 24.7804 46.9006 51.5505 11.6006 0.4288 502.9696 58.2154 414.1853 2.9435 20.4197 15.7444 0.0596 1.8305 22.1433 44.3522 39.2308 41.3778 14.7962 21.3873 29.7059 2.8593 3.3807 0.8650 1.4929 0.2370 12.4554 24.1700 29.2005 8.7512 20.3825 28.9457 21.4200 20.3683
temp: 298.150 k
press: 1.00000 atm
elementType: 8 8 8 8 8 8 8 6 6 6 6 6 6 6 6 6 6 6 6 6 6 6 6 6 6 6 6 6 6 1 1 1 1 1 1 1 1 1 1 1 1 1 1 1 1 1 1 1 1
symmnumber: 1
zpe: 976581.7 jmol-1
zpe.correction: 0.371960 hartree
zpe.thermalcorrener: 0.399971 hartree
zpe.thermalcorrenthalpy: 0.400916 hartree
zpe.thermalcorrgfe: 0.306349 hartree
zpe.sumelectzpe: -1374.759977 hartree
zpe.sumelectthermal: -1374.731966 hartree
zpe.sumelectthermalent: -1374.731021 hartree
zpe.sumelectthermalfe: -1374.825588 hartree
dipole: -1.0625 1.0282 0.6833
dipole: 1.6288
quadrupole: -142.1017 -151.2403 -162.7798
quadrupole: -3.4287 -0.6546 1.8726
quadrupole: 9.9389 0.8003 -10.7392 -3.4287 -0.6546 1.8726
hfenergy: -1375.131937 hartree
pointgroup: C01 [X(C22H20O7)]
dipole: -0.5278675 -0.0214055 -0.3626902 debye
polarizability: 315.9631807|-44.3739912|290.7069436|25.6366079|25.5049492|204.3462157 unknown
InChI: InChI=1S/C22H20O7/c1-25-21(23)19-17(27-13-15-9-5-3-6-10-15)18(20(29-19)22(24)26-2)28-14-16-11-7-4-8-12-16/h3-12H,13-14H2,1-2H3
charge 0 multiplicity 1
49 atoms
O  1.029841 -1.192507 0.38628
O  0.42063 1.352332 1.391172
O  -2.474218 -0.295772 -0.114248
O  -3.084023 -2.606192 -1.273664
O  -4.116414 1.7229 0.3826
O  -0.866622 -3.336043 -1.321317
O  -2.473998 3.010293 1.427151
C  -0.251378 -0.717678 0.288201
C  -0.556386 0.621091 0.764756
C  -1.438662 -1.244351 -0.252666
C  -1.922207 0.843147 0.510077
C  1.262351 -2.643218 0.676804
C  0.543121 2.834307 1.128328
C  2.702509 -2.794117 1.112879
C  0.732156 3.129397 -0.344631
C  -1.730299 -2.480018 -0.978663
C  -2.817019 1.955809 0.819661
C  3.323105 -1.823043 1.938755
C  1.772989 2.502616 -1.078892
C  3.431026 -3.946653 0.728505
C  -0.12666 4.045202 -1.000594
C  4.652539 -2.008711 2.376785
C  1.954945 2.796091 -2.446754
C  4.757708 -4.13779 1.177705
C  0.063529 4.348941 -2.368811
C  5.372137 -3.168678 2.003387
C  1.104211 3.725123 -3.093775
C  -3.446222 -3.806011 -2.064391
C  -5.087893 2.797183 0.695017
H  1.022482 -3.23688 -0.220282
H  0.558154 -2.92811 1.485985
H  1.438929 3.078681 1.722628
H  -0.345787 3.340957 1.536732
H  2.765968 -0.920853 2.212423
H  2.421612 1.773351 -0.578945
H  2.962788 -4.693658 0.075675
H  -0.942956 4.513622 -0.437709
H  5.127678 -1.250943 3.010124
H  2.756942 2.3042 -3.008307
H  5.311853 -5.033737 0.876107
H  -0.602234 5.061993 -2.867862
H  6.402738 -3.312306 2.347109
H  1.24942 3.955388 -4.155348
H  -4.533317 -3.726215 -2.200707
H  -3.178826 -4.723959 -1.514238
H  -2.920444 -3.798848 -3.034098
H  -6.04369 2.424131 0.302641
H  -4.793099 3.73725 0.198608
H  -5.139906 2.963687 1.784205
