program: Gaussian 09
title: 000289071
version: EM64L-G09RevD.01
frameworkgroup: C1[X(C8H12N2O2)]
method: RPBEPBE
basis: SDD
operation: Freq
keyword: #p
keyword: freq=noraman
keyword: PBEPBE/SDD
title: #p freq=noraman PBEPBE/SDD
converged: NO YES NO NO
title: Mulliken charges:
elementType: O O N N C C C C C C C C H H H H H H H H H H H H
charge: -0.247110 -0.249417 -0.397825 -0.356024 -0.030931 -0.536559 0.298033 -0.696755 -0.713314 0.111611 -0.265980 0.149578 0.206663 0.200405 0.248314 0.205686 0.207411 0.243454 0.204601 0.219011 0.222542 0.268061 0.361733 0.346811
chargesum: 0.00000
title: Mulliken charges with hydrogens summed into heavy atoms:
elementType: O O N N C C C C C C C C
charge: -0.247110 -0.249417 -0.036091 -0.009213 0.175733 -0.087841 0.298033 -0.040203 -0.067160 0.111611 0.002080 0.149578
polarizability: 1.34887149e+02 -9.37297613e+00 1.10664855e+02 1.12031730e+01 1.77600162e+00 7.17606328e+01
1716.lowfreq: -3.4092 -0.0009 0.0003 0.0008 6.7617 14.6447 58.8302 69.2383 84.8706
frequency: 58.6978 69.2099 84.6891 151.5951 167.9218 214.1833 237.0999 248.3736 315.4564 361.3423 371.4058 376.8738 412.3575 420.2513 519.5073 567.7646 583.3251 631.1080 698.7796 709.7317 745.8259 763.4650 791.8877 808.5548 873.9197 901.3402 920.7676 947.7235 957.2834 964.8147 1072.3879 1092.7857 1137.6694 1178.5962 1183.8878 1223.8464 1237.5904 1278.6978 1325.5822 1341.5519 1351.9895 1367.7672 1377.4007 1388.2819 1401.1071 1440.7447 1458.6260 1464.0031 1474.9231 1481.7438 1489.3593 1612.9310 1649.7824 1681.5517 2964.9942 2966.3656 2978.0889 2990.2548 3053.8541 3058.6580 3065.8633 3070.1488 3088.7332 3168.2847 3526.3172 3566.6956
redmass: 3.3174 5.4432 2.9861 5.0834 8.3023 1.1749 2.7709 1.0469 4.2007 6.7767 1.9382 2.4417 3.0593 4.6475 7.1577 4.2839 3.9740 1.2277 2.5629 4.2815 4.9068 2.4838 3.3665 3.1356 1.6379 1.3981 1.2202 2.5362 2.0713 1.7024 2.0141 1.5655 2.9975 2.0578 2.1983 4.3235 1.1441 1.4456 1.5534 2.0786 1.4052 1.6467 1.2396 2.1446 1.2191 2.2426 1.1656 1.0469 1.0538 1.0506 1.0546 6.2830 6.2596 5.5936 1.0679 1.0479 1.0365 1.0645 1.1002 1.0995 1.0992 1.0983 1.0996 1.0943 1.0771 1.0786
irintensity: 1.6091 0.2670 1.5844 0.2589 4.3335 0.2925 1.6511 0.2053 2.1320 14.8473 2.7106 2.6501 10.2748 9.8909 7.4297 6.7454 13.4423 85.0438 5.3111 5.1149 16.8721 59.6761 91.9040 1.0062 1.7474 20.0776 2.2302 6.1772 1.7630 0.4640 1.1615 1.9362 20.1977 91.8038 6.7968 36.1262 2.1092 15.5860 6.3737 50.1408 1.3371 12.0190 14.8297 61.0888 15.9305 33.1774 9.4337 8.4684 0.6106 28.0420 14.5058 128.6294 202.2821 742.8696 28.8476 19.4111 29.6610 43.3164 4.0271 36.9451 20.9891 104.2149 23.8605 6.8286 54.2430 83.7945
temp: 298.150 k
press: 1.00000 atm
elementType: 8 8 7 7 6 6 6 6 6 6 6 6 1 1 1 1 1 1 1 1 1 1 1 1
symmnumber: 1
zpe: 514910.5 jmol-1
zpe.correction: 0.196119 hartree
zpe.thermalcorrener: 0.207937 hartree
zpe.thermalcorrenthalpy: 0.208881 hartree
zpe.thermalcorrgfe: 0.158259 hartree
zpe.sumelectzpe: -571.128591 hartree
zpe.sumelectthermal: -571.116774 hartree
zpe.sumelectthermalent: -571.115829 hartree
zpe.sumelectthermalfe: -571.166452 hartree
dipole: -2.2727 -3.9656 -0.9694
dipole: 4.6724
quadrupole: -82.4584 -70.6138 -72.6613
quadrupole: 1.5633 -2.6692 3.6892
quadrupole: -7.2139 4.6307 2.5832 1.5633 -2.6692 3.6892
hfenergy: -571.3247105 hartree
pointgroup: C01 [X(C8H12N2O2)]
dipole: 0.8390457 1.6087481 -0.2951074 debye
dipolederiv: -0.6403666 0.1301169 0.0389066 0.323312 -1.0987782 -0.0806683 0.0424681 -0.0273596 -0.374694 -1.4575901 0.0829272 0.2640364 0.0182455 -0.477329 -0.0044988 0.3344169 -0.0193869 -0.4720268 -1.0591352 0.3501413 0.1740511 0.3964068 -0.5477501 -0.1100947 0.1926645 -0.0963132 -0.3786545 -1.2174248 0.2907235 0.1716244 -0.5444484 -0.480858 0.1477759 0.3294372 -0.0766164 -0.3610575 0.2287763 -0.0000424 0.0205639 0.0415568 0.1655262 0.0185819 0.1587143 0.0079156 0.1507084 0.0092146 0.004257 -0.0356989 -0.0630077 0.0330955 -0.0243913 -0.1579925 -0.0257124 0.0750079 0.0546551 -0.0856802 -0.0095754 0.1549692 -0.6964989 -0.0247106 -0.0992564 0.0589678 -0.1475495 0.0528272 -0.001682 -0.0155051 -0.0317463 -0.0588179 0.0582955 -0.0214238 0.0389449 -0.0270248 0.0242396 -0.0077293 -0.0399104 -0.0067375 -0.0793593 -0.0633495 -0.0782693 -0.0639354 0.0162615 1.1184289 -0.0955831 -0.2137303 -0.3415605 1.3647495 0.0643859 -0.2014287 -0.0253086 0.3160667 0.8109352 -0.5239206 -0.1701352 -0.0985278 0.3720242 0.0033896 -0.2539143 0.1404259 0.0100179 1.9743391 -0.1428774 -0.4353732 0.2038917 1.0084836 -0.0685232 -0.5399581 -0.0041438 0.4583539 -0.2110394 0.0295495 0.0995621 0.0208259 0.0208289 -0.0195849 0.0645275 -0.0174475 -0.0245873 -0.0184467 0.0032082 0.0153283 -0.0322032 -0.0315098 0.1697075 0.0457329 0.0902129 -0.0518395 0.0448354 -0.0101758 -0.0013824 0.0456399 -0.0302388 -0.1157363 0.0044945 -0.0535156 0.0540333 -0.0888538 0.0216439 0.1286554 0.0687139 0.0464819 -0.0245029 0.1199263 -0.0050553 0.0227271 -0.0979775 0.008802 -0.1503466 -0.0405327 0.0965996 -0.0113808 -0.1527871 0.0252196 -0.053496 0.1308798 -0.0336776 0.01246 -0.0149477 -0.1050395 -0.0423165 0.0274832 -0.0789402 0.0584645 0.0931532 -0.0000652 0.0147165 -0.0186101 -0.076682 0.1103806 0.0457862 0.1565357 -0.0645932 -0.0936808 0.0704825 0.1173063 0.0349853 0.0527162 -0.0080487 0.12109 -0.0072045 0.0390957 -0.074076 -0.0555763 -0.1349537 -0.020569 0.0818489 -0.0212402 -0.1502334 -0.0503463 -0.030649 0.0628643 -0.0558294 0.0482871 -0.0729569 -0.0111037 0.0267428 0.048048 0.0250143 0.1379055 0.1718253 0.0386705 0.0480072 0.0377293 0.2005511 0.0014356 0.0542582 -0.0047323 0.317771 0.1816168 -0.0176831 0.053106 -0.0604285 0.2510595 0.0183513 0.0662157 0.0127813 0.3297586 unknown
polarizability: 136.0311371|-7.9022331|110.0912001|-10.132325|-0.7271461|71.1903 unknown
InChI: InChI=1S/C8H12N2O2/c1-5(2)3-6-4-9-8(12)10-7(6)11/h4-5,9-10H,3H2,1-2H3
charge 0 multiplicity 1
24 atoms
O  0.052675 -2.316741 -0.425976
O  -3.719724 0.257704 0.61074
N  -1.793889 -0.994529 0.092059
N  -1.758034 1.337688 -0.089895
C  2.780954 0.220762 0.072419
C  1.719868 0.038717 -1.065619
C  0.272877 0.10678 -0.622158
C  2.609466 -0.81632 1.206454
C  2.792539 1.661079 0.636111
C  -0.436483 -1.154053 -0.325968
C  -0.426509 1.287106 -0.501885
C  -2.518894 0.197315 0.234441
H  3.764003 0.039789 -0.411363
H  1.908448 0.805359 -1.842697
H  1.87882 -0.952814 -1.528526
H  1.67427 -0.635533 1.769468
H  3.449185 -0.751199 1.923077
H  2.563752 -1.84481 0.80828
H  2.944694 2.410787 -0.164239
H  1.842748 1.893761 1.15441
H  3.60734 1.783325 1.373274
H  0.033859 2.251804 -0.732067
H  -2.305201 -1.857456 0.303866
H  -2.253263 2.227278 -0.010208
