program: Gaussian 09
title: 000289076
version: EM64L-G09RevD.01
frameworkgroup: C1[X(C4F9NOS)]
method: RPBEPBE
basis: SDD
operation: Freq
keyword: #p
keyword: freq=noraman
keyword: PBEPBE/SDD
title: #p freq=noraman PBEPBE/SDD
converged: YES YES NO NO
title: Mulliken charges:
elementType: S F F F F F F F F F O N C C C C
charge: 0.744791 -0.137408 -0.138411 -0.118551 -0.124640 -0.144124 -0.121545 -0.111690 -0.114889 -0.122963 -0.486548 -0.215979 0.009636 0.400804 0.391424 0.290094
chargesum: 0.00000
title: Mulliken charges with hydrogens summed into heavy atoms:
polarizability: 1.22803551e+02 -7.44516059e+00 8.70863536e+01 9.10757205e-01 2.63081894e+00 5.94139479e+01
1716.lowfreq: -4.8442 -0.0004 0.0016 0.0020 4.3206 6.1014 10.6544 36.7401 44.5780
frequency: 10.2822 36.7361 44.5611 55.8033 66.8160 89.1387 117.9469 138.9253 153.1010 158.1262 200.3336 236.0425 252.8882 263.9416 271.4660 296.0088 339.2227 385.8419 433.2516 438.4057 447.4617 458.6902 462.8007 473.1211 484.7971 587.9616 629.4068 636.8906 688.9359 697.3871 877.3635 905.0762 947.7699 992.9547 1018.7241 1048.4613 1069.1041 1088.2135 1103.7523 1111.6020 1189.9376 1606.1663
redmass: 18.5822 18.8889 18.6824 18.4777 18.7541 16.7201 17.4788 18.4213 16.9695 18.0185 18.1181 17.1763 19.2681 18.6001 18.7988 18.4151 22.3121 20.6989 17.4111 17.3795 15.9234 17.9178 16.9844 18.1839 18.2943 15.8373 16.7163 16.9392 16.9221 13.4446 15.0001 17.4242 14.0549 13.2889 13.1170 12.9983 13.2900 13.2526 12.8825 12.8436 12.2390 12.7204
irintensity: 0.2654 0.0110 0.1577 0.5454 0.2176 1.4317 1.5075 0.6887 3.1051 3.0759 5.2463 3.5430 3.1236 0.8316 2.3685 0.3779 22.2298 19.1770 9.1160 3.2532 1.5309 4.2723 3.4348 2.0255 3.8976 16.7427 40.6288 15.2102 0.3928 4.0866 33.5285 158.8758 337.9601 5.4875 27.6726 382.7917 202.7993 283.2404 190.3028 316.0266 228.3617 7.7581
temp: 298.150 k
press: 1.00000 atm
elementType: 16 9 9 9 9 9 9 9 9 9 8 7 6 6 6 6
symmnumber: 1
zpe: 134672.1 jmol-1
zpe.correction: 0.051294 hartree
zpe.thermalcorrener: 0.068235 hartree
zpe.thermalcorrenthalpy: 0.069179 hartree
zpe.thermalcorrgfe: 0.003194 hartree
zpe.sumelectzpe: -1577.659058 hartree
zpe.sumelectthermal: -1577.642117 hartree
zpe.sumelectthermalent: -1577.641172 hartree
zpe.sumelectthermalfe: -1577.707157 hartree
dipole: -0.9494 -0.5266 -1.8307
dipole: 2.1285
quadrupole: -97.9066 -103.1816 -93.2317
quadrupole: 1.7996 2.8964 -3.0103
quadrupole: 0.2000 -5.0750 4.8750 1.7996 2.8964 -3.0103
hfenergy: -1577.7103517 hartree
pointgroup: C01 [X(C4F9N1O1S1)]
dipole: -0.3792126 0.2550474 0.7017085 debye
dipolederiv: 0.6766031 0.1099973 -0.0429771 0.2139162 0.8864556 -0.1665809 0.0106621 0.1463378 0.3844141 -0.5898647 -0.0393105 0.2370537 -0.1169097 -0.3456795 -0.0350587 0.3142355 -0.0417959 -0.6310733 -0.7093598 -0.0790824 -0.2594544 -0.1826571 -0.3483397 0.0060162 -0.2950062 0.0102051 -0.5617117 -0.3785161 0.0622363 -0.0050412 0.0862164 -0.7348991 0.0118849 0.0005391 0.0266649 -0.2542988 -0.8720102 0.0441413 -0.0451778 0.2083954 -0.3052927 -0.0065194 -0.0288029 -0.0042601 -0.2548357 -0.3604228 0.0086677 0.1165813 0.0342041 -0.4475708 0.2116688 0.1406702 0.14586 -0.4989399 -0.2795311 0.0389883 -0.0901096 0.1634881 -0.344966 -0.1806171 -0.0175927 -0.1087832 -0.6258686 -0.3880581 0.0372363 0.1238383 0.1310582 -0.35829 0.1678329 -0.0652988 0.2659402 -0.7844227 -0.3973469 0.1597703 0.0031572 0.3381827 -0.816146 -0.2280771 0.0049373 -0.208167 -0.4035623 -1.0561503 0.0026748 -0.0958733 -0.0611889 -0.3232895 0.0058005 -0.1935346 0.0410966 -0.2789711 -0.3896716 -0.0420591 0.0294538 -0.2204717 -0.6032442 0.2287188 -0.1411896 -0.2681863 -0.2188121 -0.3352103 -0.1415851 -0.0192604 0.1772907 -0.2196459 -0.0575859 0.0919173 0.0737298 -0.2357205 0.0037661 0.0982559 -0.0423941 -0.3245426 -0.1111752 0.0344266 -0.0490637 0.0042331 -0.1335667 1.6231988 0.0613807 0.0351732 0.4452523 1.5318127 -0.0024061 -0.041924 -0.0223897 1.5364766 1.514529 -0.1349451 0.0493074 -0.4662061 1.1333658 -0.0212646 -0.0050732 -0.0170763 1.4844849 1.9380449 -0.1863666 0.005723 -0.426028 1.4069044 0.0317611 0.2745242 -0.043409 1.476408 unknown
polarizability: 123.292021|6.129049|86.8131426|0.0579523|1.4245089|59.1986894 unknown
InChI: InChI=1S/C4F9NOS/c5-2(6,7)1(3(8,9)10)14-16(15)4(11,12)13
charge 0 multiplicity 1
16 atoms
S  -1.791859 -0.768299 0.828697
F  2.732839 0.977687 -1.15749
F  2.949105 1.128594 1.108098
F  1.479715 2.455007 0.013486
F  2.817112 -1.500677 0.14877
F  0.85239 -2.199419 1.025193
F  1.053292 -1.88048 -1.2237
F  -2.363303 0.892646 -1.446061
F  -2.923358 1.816729 0.561235
F  -4.180867 0.141188 -0.321114
O  -1.87637 -2.075242 -0.129565
N  -0.251706 0.490149 0.486965
C  0.940793 0.080758 0.21404
C  2.023578 1.174763 0.045058
C  1.426371 -1.378058 0.031333
C  -2.887929 0.644654 -0.184945
