program: Gaussian 09
title: 000289107
version: EM64L-G09RevD.01
frameworkgroup: C1[X(C16H14N2O2S)]
method: RPBEPBE
basis: SDD
operation: Freq
keyword: #p
keyword: freq=noraman
keyword: PBEPBE/SDD
title: #p freq=noraman PBEPBE/SDD
converged: YES YES NO NO
title: Mulliken charges:
elementType: S O O N N C C C C C C C C C C C C C C C C H H H H H H H H H H H H H H
charge: 0.234100 -0.204153 -0.185494 -0.317109 -0.698138 -0.603280 -0.497404 0.240652 0.163314 0.488907 -0.402087 -0.344541 -0.330258 0.518949 -0.228761 -0.218923 -0.220038 -0.239160 -0.393046 -0.271067 -0.194573 0.318768 0.303142 0.269992 0.265799 0.259528 0.255788 0.231311 0.228253 0.231838 0.221260 0.232288 0.226197 0.304247 0.353700
chargesum: 0.00000
title: Mulliken charges with hydrogens summed into heavy atoms:
elementType: S O O N N C C C C C C C C C C C C C C C C
charge: 0.234100 -0.204153 -0.185494 -0.317109 -0.040191 -0.284512 0.075729 0.240652 0.163314 0.488907 -0.402087 -0.078742 -0.070730 0.518949 0.027027 0.012388 0.008215 -0.007322 -0.171786 -0.038779 0.031623
polarizability: 2.41202106e+02 -1.45515798e+01 2.01850599e+02 1.02998779e+01 -9.08073274e+00 1.72083681e+02
1716.lowfreq: -8.9193 -3.0791 -0.0016 -0.0012 0.0011 5.2159 16.3269 24.1307 43.2062
frequency: 16.1647 24.1023 43.2053 56.1776 86.7026 91.6625 101.7888 147.9378 161.0827 188.4751 247.4730 263.0576 272.1376 280.9999 324.7145 363.9335 373.2320 401.5643 408.1457 434.9941 448.8983 474.9503 481.3974 511.7359 543.8440 545.3922 561.2616 568.8976 594.4842 605.5911 617.6704 660.2060 676.5780 692.5453 717.8247 724.2568 744.7840 757.7793 777.0571 829.2252 837.0512 849.9708 911.4810 914.4253 945.8210 949.3947 969.4439 975.1833 990.6900 993.2184 1001.0738 1007.6554 1029.1351 1034.7536 1043.1977 1058.5484 1088.5577 1136.7065 1142.0343 1156.9015 1167.6299 1172.1272 1175.3694 1193.3556 1205.2576 1244.1371 1262.8220 1284.0884 1325.0139 1328.3106 1329.6451 1382.8290 1385.2174 1436.3877 1440.4021 1444.0112 1481.7759 1485.9658 1566.5505 1595.6825 1606.9219 1610.5387 1628.5368 1640.3464 1693.4460 3007.9944 3043.6600 3090.5288 3120.0337 3132.3000 3135.0625 3144.6787 3144.7130 3162.0399 3170.3664 3179.9060 3187.4343 3497.9580 3667.4105
redmass: 6.0635 5.5228 4.3660 6.1454 5.9799 5.4891 4.2415 7.6767 4.5867 5.5035 4.2699 6.7328 5.4407 8.5858 5.4407 6.6829 6.1944 1.8808 1.4163 4.6385 3.1908 3.7269 5.0497 4.1634 2.6178 5.0545 2.2729 1.6711 7.1031 6.1208 5.6952 6.4408 6.1027 1.9307 5.4061 3.0397 2.9581 1.4122 2.4298 5.1068 1.2587 1.4864 6.3867 1.4340 1.3576 2.0391 1.3906 1.3190 5.8999 1.3705 3.2084 4.1314 2.1902 2.3306 1.9063 2.4168 1.6746 1.3372 5.6412 3.1305 1.4345 1.0630 1.0498 1.1423 1.2479 1.3543 1.6222 1.5321 2.0506 1.3799 3.9228 6.9115 9.5979 1.2558 1.9899 2.2303 3.0751 2.3275 6.2423 6.5098 3.8377 5.9572 4.9715 1.5952 12.4132 1.0649 1.0848 1.0973 1.0868 1.0855 1.0883 1.0914 1.0937 1.0963 1.0999 1.0959 1.0969 1.0498 1.0996
irintensity: 0.1310 0.4477 0.4615 1.0981 0.6102 2.0725 7.5119 6.7911 2.8831 0.4794 8.0289 4.1077 1.2832 5.0760 9.0854 1.0761 0.4459 47.5330 106.8211 12.5041 5.2871 12.3349 7.7165 11.8929 48.4450 11.9645 64.0932 131.5163 9.6917 5.0276 1.6590 1.8205 18.9937 40.6958 24.3959 2.0122 14.5335 97.0800 44.4699 6.6077 0.3592 2.5046 8.7837 2.8763 2.7112 8.9466 0.1484 0.1716 0.3977 0.3216 3.3957 3.0136 4.1360 2.1705 11.3150 9.9362 3.6573 6.9872 207.9556 41.8815 28.6476 8.3468 0.0182 0.8221 3.1227 2.1244 9.0002 13.1404 12.3364 12.0355 213.1209 21.0849 0.9023 4.0446 16.9873 14.4111 74.0057 64.3343 10.1090 10.5678 19.7454 7.3478 233.7871 383.2909 36.8745 16.1157 1.3772 2.1845 8.6486 0.0808 0.4246 6.7029 34.2602 30.9899 20.8091 4.8987 2.1757 77.2002 37.5526
temp: 298.150 k
press: 1.00000 atm
elementType: 16 8 8 7 7 6 6 6 6 6 6 6 6 6 6 6 6 6 6 6 6 1 1 1 1 1 1 1 1 1 1 1 1 1 1
symmnumber: 1
zpe: 697588.1 jmol-1
zpe.correction: 0.265697 hartree
zpe.thermalcorrener: 0.284005 hartree
zpe.thermalcorrenthalpy: 0.284949 hartree
zpe.thermalcorrgfe: 0.217237 hartree
zpe.sumelectzpe: -1274.669379 hartree
zpe.sumelectthermal: -1274.651071 hartree
zpe.sumelectthermalent: -1274.650127 hartree
zpe.sumelectthermalfe: -1274.717839 hartree
dipole: -0.2727 1.2716 0.0715
dipole: 1.3025
quadrupole: -123.8681 -110.1098 -141.1987
quadrupole: -2.5648 5.6918 -1.2367
quadrupole: 1.1907 14.9491 -16.1398 -2.5648 5.6918 -1.2367
hfenergy: -1274.935076 hartree
pointgroup: C01 [X(C16H14N2O2S1)]
dipole: -0.0475738 0.2664699 -0.4351038 debye
polarizability: 238.8062188|-12.3323019|172.9302417|16.0827887|-10.2277314|203.3999251 unknown
InChI: InChI=1S/C16H14N2O2S/c17-12-8-4-5-9-13(12)21-14-10-15(19)18(16(14)20)11-6-2-1-3-7-11/h1-9,14H,10,17H2
charge 0 multiplicity 1
35 atoms
S  2.104081 -2.488044 0.672311
O  -0.960667 -2.157926 -0.528226
O  -0.903357 1.278276 2.693487
N  -1.175663 -0.259661 0.892886
N  1.545873 -1.051298 -2.043648
C  0.477767 -1.884642 1.49236
C  0.606312 -0.683463 2.438016
C  -0.604879 -1.497966 0.475654
C  -0.555104 0.244594 2.084527
C  -2.249468 0.408242 0.194462
C  2.848441 -0.924694 0.04407
C  -3.305164 1.003198 0.925901
C  -2.229875 0.467758 -1.219996
C  2.506248 -0.431052 -1.259479
C  3.840735 -0.278568 0.819068
C  -4.344182 1.659858 0.232149
C  -3.279389 1.119383 -1.901086
C  -4.338493 1.71788 -1.180274
C  3.188874 0.734221 -1.729587
C  4.504276 0.871492 0.34034
C  4.164497 1.370034 -0.941749
H  0.143881 -2.802192 2.00907
H  1.543637 -0.122419 2.263194
H  0.571649 -0.950961 3.506344
H  -3.305678 0.966374 2.017696
H  -1.408275 0.005651 -1.772924
H  4.099538 -0.702116 1.795995
H  -5.158687 2.12434 0.798144
H  -3.267177 1.162191 -2.99558
H  -5.149632 2.225295 -1.713625
H  2.941568 1.129905 -2.722237
H  5.269607 1.362842 0.948372
H  4.669007 2.26134 -1.332079
H  1.367849 -0.726504 -2.989906
H  1.068049 -1.891471 -1.712152
