program: Gaussian 09
title: 000289079
version: EM64L-G09RevD.01
frameworkgroup: C1[X(C14H18N2O2)]
method: RPBEPBE
basis: SDD
operation: Freq
keyword: #p
keyword: freq=noraman
keyword: PBEPBE/SDD
title: #p freq=noraman PBEPBE/SDD
converged: NO YES NO NO
title: Mulliken charges:
elementType: O O N N C C C C C C C C C C C C C C H H H H H H H H H H H H H H H H H H
charge: -0.265631 -0.250170 -0.068046 -0.396691 0.293676 -0.569413 -0.553056 -0.206284 -0.531944 0.227000 0.226187 -0.640774 0.262608 -0.410094 -0.379488 -0.279623 -0.206940 -0.507009 0.250185 0.249155 0.228782 0.245195 0.259555 0.266968 0.211600 0.272214 0.234093 0.196542 0.235845 0.226255 0.224132 0.218694 0.217906 0.242858 0.234055 0.241657
chargesum: 0.00000
title: Mulliken charges with hydrogens summed into heavy atoms:
elementType: O O N N C C C C C C C C C C C C C C
charge: -0.265631 -0.250170 -0.068046 -0.124477 0.293676 -0.070073 -0.079080 0.053271 -0.053377 0.227000 0.226187 0.025706 0.262608 -0.183839 -0.155356 -0.060929 0.010966 0.211562
polarizability: 2.23813162e+02 -6.38405366e+00 1.69418091e+02 6.59311793e+00 -4.97793361e+00 1.07695072e+02
1716.lowfreq: -10.7024 -2.8902 -0.0009 -0.0007 -0.0005 5.0564 34.1344 51.8521 56.7375
frequency: 33.9074 51.6232 56.7115 70.7611 83.3286 97.3456 121.4493 163.7933 188.2660 206.9262 209.9016 232.9797 263.9259 309.4758 325.9764 337.4133 348.9202 383.5831 429.2113 434.5096 461.4486 470.7080 538.1073 564.4670 605.3227 625.8942 683.7223 703.8117 707.8273 739.5338 745.8295 754.0615 797.8800 836.5806 840.0738 846.1774 856.6236 914.1991 919.8212 941.7143 959.4430 962.7372 984.7177 1007.4291 1015.2765 1022.2756 1041.5920 1075.7610 1094.3326 1106.4399 1109.3830 1112.1800 1114.9353 1130.4246 1147.2593 1155.9183 1167.4748 1176.1620 1193.7982 1232.5964 1241.3800 1266.7742 1271.5005 1278.0821 1306.9754 1317.5411 1328.1865 1350.7423 1373.6902 1419.6374 1422.1521 1432.0250 1451.8220 1458.8700 1462.3389 1463.7964 1469.2394 1471.9994 1478.2768 1481.1877 1502.8231 1599.5703 1622.1760 1634.3016 2872.6048 2916.4804 2993.5103 3004.5515 3019.3165 3030.6481 3064.5640 3070.6183 3080.0083 3086.2413 3088.1213 3107.0188 3114.2267 3122.5326 3140.0332 3149.6460 3159.8410 3573.6564
redmass: 4.8496 4.4111 3.7021 3.5702 1.3360 2.2218 4.1877 3.3690 2.2144 1.3130 4.2049 3.0869 3.7639 3.7534 4.3265 2.3175 3.4219 2.8296 1.3178 2.9228 2.9138 2.9667 4.8884 3.7005 4.9648 4.8065 4.3880 7.8984 4.9828 1.7095 2.3701 4.1981 3.1579 3.1443 1.8823 2.9586 3.7566 3.3833 1.6037 1.9338 1.2993 2.3993 2.7544 3.1018 2.6057 2.1565 2.5778 2.3327 2.2643 1.6940 2.0852 1.3117 1.6231 2.4189 1.4682 1.6306 1.1031 1.8612 1.4547 1.4741 1.4800 1.5150 1.6676 2.1466 1.4840 1.6123 1.2483 1.6275 2.4317 1.2008 2.4692 1.1548 1.0515 1.4287 1.4908 1.0526 1.1668 1.0850 1.9037 1.1115 1.3121 6.5253 7.0816 8.5149 1.0550 1.0713 1.0643 1.0294 1.0614 1.0745 1.0899 1.0987 1.0955 1.1003 1.1003 1.1045 1.0866 1.0876 1.0936 1.1048 1.0998 1.0783
irintensity: 2.0559 0.5256 0.9127 0.5321 1.1878 1.5085 0.9296 0.3191 4.1689 5.4963 3.9089 3.1245 9.8849 14.2469 4.8270 4.9229 4.5995 13.5149 135.1912 9.8508 4.4311 14.3790 2.2674 0.0851 32.1194 4.5560 8.9779 11.2347 9.3913 71.2646 20.2185 8.4521 3.3468 3.0209 4.0422 10.9267 12.7280 4.1516 2.1566 3.5424 0.2901 6.4035 31.9652 23.4261 14.6614 5.4972 22.0637 42.3487 1.1623 1.0669 119.8584 1.1942 40.7919 205.7933 21.4735 7.6423 0.8856 11.0859 17.8618 5.2082 9.4327 5.1027 4.4435 20.1904 61.5607 6.3241 6.5281 27.7589 24.7394 16.9899 4.8605 3.5295 14.4719 10.4313 15.5028 13.1387 4.1303 28.3834 52.8640 9.3262 31.3130 0.6500 62.0041 160.0262 106.3582 78.4585 37.8619 37.4083 11.8774 53.1499 11.2963 10.5093 2.7089 29.9272 23.5380 25.0400 10.5037 7.3429 34.9358 17.3689 32.4933 19.2119
temp: 298.150 k
press: 1.00000 atm
elementType: 8 8 7 7 6 6 6 6 6 6 6 6 6 6 6 6 6 6 1 1 1 1 1 1 1 1 1 1 1 1 1 1 1 1 1 1
symmnumber: 1
zpe: 780040.9 jmol-1
zpe.correction: 0.297102 hartree
zpe.thermalcorrener: 0.314163 hartree
zpe.thermalcorrenthalpy: 0.315107 hartree
zpe.thermalcorrgfe: 0.251768 hartree
zpe.sumelectzpe: -802.876220 hartree
zpe.sumelectthermal: -802.859159 hartree
zpe.sumelectthermalent: -802.858215 hartree
zpe.sumelectthermalfe: -802.921553 hartree
dipole: 1.3233 -0.0883 -0.2212
dipole: 1.3446
quadrupole: -96.5598 -97.5908 -109.2493
quadrupole: 2.5154 -3.4347 -1.1172
quadrupole: 4.5735 3.5425 -8.1160 2.5154 -3.4347 -1.1172
hfenergy: -803.1733219 hartree
pointgroup: C01 [X(C14H18N2O2)]
dipole: -0.5076291 -0.1302055 0.0720353 debye
polarizability: 222.4214458|11.3778225|154.2739583|3.5113506|28.4817096|124.2309208 unknown
InChI: InChI=1S/C14H18N2O2/c1-16-9-14(7-12(16)13(17)18-2)8-15-11-6-4-3-5-10(11)14/h3-6,12,15H,7-9H2,1-2H3
charge 0 multiplicity 1
36 atoms
O  -4.167557 -0.68064 0.735089
O  -2.726877 -1.443987 -0.926762
N  -1.711272 1.34865 0.098244
N  1.86313 -1.702212 -1.170384
C  0.278498 -0.072528 -0.384224
C  -0.474078 -0.589157 0.899089
C  -0.658959 1.07745 -0.919169
C  -1.884775 0.072955 0.857805
C  0.497902 -1.197703 -1.456163
C  1.725802 0.322932 -0.059659
C  2.604685 -0.699312 -0.527692
C  -1.508841 2.535243 0.956034
C  -2.92209 -0.77109 0.114143
C  2.241963 1.425961 0.637145
C  3.998435 -0.625188 -0.303337
C  3.642108 1.518517 0.866873
C  4.502724 0.496499 0.400171
C  -5.281201 -1.384309 0.051921
H  0.054187 -0.240511 1.803771
H  -0.509999 -1.691045 0.934832
H  -0.09896 2.001502 -1.142373
H  -1.139847 0.735117 -1.85467
H  -2.285328 0.287925 1.862051
H  -0.269958 -1.983845 -1.385676
H  0.445221 -0.751298 -2.475527
H  2.305801 -2.384636 -1.784653
H  -1.394306 3.428997 0.318918
H  -0.61923 2.472648 1.630015
H  -2.403439 2.687154 1.585107
H  1.577253 2.220211 0.999423
H  4.675177 -1.408894 -0.662365
H  4.054752 2.380743 1.401422
H  5.5817 0.573518 0.579432
H  -5.479408 -0.913927 -0.925821
H  -6.141013 -1.271699 0.726822
H  -5.027105 -2.44654 -0.101431
