program: Gaussian 09
title: 000289104
version: EM64L-G09RevD.01
frameworkgroup: C1[X(C17H18N2O2S2)]
method: RPBEPBE
basis: SDD
operation: Freq
keyword: #p
keyword: freq=noraman
keyword: PBEPBE/SDD
title: #p freq=noraman PBEPBE/SDD
converged: YES YES NO NO
title: Mulliken charges:
elementType: S S O O N N C C C C C C C C C C C C C C C C C H H H H H H H H H H H H H H H H H H
charge: 0.245177 0.068592 -0.265752 -0.263618 -0.138717 -0.069255 -0.442746 -0.727300 0.468776 0.426428 -0.642916 -0.375786 -0.328503 -0.333982 -0.299550 -0.352227 -0.363910 0.318777 -0.347480 -0.336345 0.326100 -0.537852 -0.538274 0.262322 0.266010 0.287596 0.292575 0.241754 0.263991 0.255623 0.260506 0.253691 0.244169 0.244745 0.253481 0.223857 0.221934 0.246090 0.247080 0.225049 0.219891
chargesum: 0.00000
title: Mulliken charges with hydrogens summed into heavy atoms:
elementType: S S O O N N C C C C C C C C C C C C C C C C C
charge: 0.245177 0.068592 -0.265752 -0.263618 -0.138717 -0.069255 0.085585 -0.147129 0.468776 0.426428 -0.642916 -0.134032 -0.064512 -0.078359 -0.039044 -0.098537 -0.119741 0.318777 -0.102735 -0.082864 0.326100 0.154030 0.153745
polarizability: 2.72706906e+02 5.38253325e+00 2.71948313e+02 1.27609390e+00 -2.73993256e+00 1.90814083e+02
1716.lowfreq: -12.5639 -4.9522 -3.2624 -0.0009 -0.0004 0.0006 10.9926 15.0041 32.8080
frequency: 3.8626 13.8879 32.7559 38.5028 50.2779 70.0371 86.6394 102.6917 103.8131 142.0314 169.6507 178.4642 199.7598 226.7748 236.2391 240.2820 255.5640 287.5282 302.3025 323.7249 342.3070 379.5905 392.5786 415.6236 415.9298 426.6798 437.3305 463.2620 490.7758 501.9048 510.2603 527.5303 540.4429 553.5096 570.7579 614.6058 632.9880 645.4107 674.3975 715.6121 724.1424 733.0747 789.7494 798.4376 808.2746 814.4830 831.9913 834.2654 894.4418 922.0628 937.1783 938.8271 956.3380 960.9284 974.0948 987.4257 988.0358 995.9449 999.1989 1017.4871 1046.1556 1106.5492 1112.4307 1112.7405 1115.2706 1143.0615 1155.2037 1156.5886 1171.4935 1185.0133 1189.3567 1192.9414 1229.2666 1232.9544 1256.1887 1263.6484 1290.5847 1303.8740 1307.0684 1368.7000 1369.7541 1375.1994 1405.0000 1418.7172 1427.0631 1436.0418 1436.6437 1453.0610 1466.4380 1466.7246 1467.9199 1472.4876 1473.5519 1495.2082 1503.3598 1582.6498 1583.1758 1617.5226 1625.5650 2960.1192 2960.4006 3000.9566 3047.8702 3048.1394 3049.0029 3112.9617 3126.4857 3126.9405 3137.1117 3137.9621 3139.7981 3141.7754 3154.7891 3165.0893 3166.7668 3169.1277 3176.3361
redmass: 3.7504 4.8892 9.8320 3.9749 5.1715 4.4421 9.8127 4.0361 4.8173 4.2559 5.4406 3.6635 2.7302 1.4918 2.0190 1.6146 2.6882 9.3856 4.6548 7.4000 3.5800 6.0163 6.4503 3.1174 2.9670 6.1060 3.7373 4.2031 3.8294 3.8894 4.3289 5.6489 4.8118 2.9644 4.4277 5.6233 6.8534 6.1365 4.6746 4.4732 3.8700 4.6388 5.1280 4.6304 1.3038 1.2987 1.6860 1.7198 1.6413 3.9747 1.3875 1.4899 1.3712 1.3576 4.1321 8.2385 7.7908 3.3762 2.6422 2.7610 2.0490 1.3103 1.2642 1.2601 1.3782 2.6852 1.3232 1.3258 1.2025 1.2991 1.6838 1.8936 3.0171 3.3899 1.4347 1.7834 1.3993 1.7810 1.3593 5.4380 2.5280 4.1283 2.0873 3.8043 3.3842 1.1795 1.1705 1.1159 1.0501 1.0508 1.1106 1.0869 1.0801 2.3897 2.4485 7.5961 7.4604 6.4239 6.3491 1.0330 1.0330 1.0671 1.1033 1.0589 1.1040 1.0986 1.0994 1.0994 1.0901 1.0938 1.1047 1.0892 1.0885 1.0943 1.0950 1.0960 1.0977
irintensity: 0.3038 0.4738 2.0061 0.9921 2.1983 1.5586 0.4182 4.7628 1.2348 5.3639 4.6273 1.4908 2.0322 0.7237 0.9131 2.2681 1.5236 0.6673 2.1990 2.9234 2.9572 5.0679 2.9342 0.3467 0.4171 8.3972 2.0264 0.2576 3.9500 23.1273 6.0863 29.1960 13.7195 29.6740 6.9958 23.9964 0.8839 18.9604 9.6188 12.5187 5.2527 3.4778 10.8181 15.2739 5.9401 9.5510 30.2958 116.9977 10.5769 23.4959 3.3983 12.1758 1.6130 1.3293 28.2923 33.3881 62.3734 12.1592 26.2562 181.1597 12.1725 11.3957 0.8460 0.1458 12.8893 24.2148 1.7613 1.4215 40.6871 87.0614 32.4650 125.7281 229.4017 117.0710 35.2411 57.2775 27.5847 98.7142 10.1927 12.6508 12.0356 4.9908 54.9128 11.2209 10.6802 19.0750 15.8754 19.8545 14.5719 15.2962 16.3198 72.6781 73.7769 165.2558 264.1824 8.9423 5.5489 46.1366 8.4967 61.4506 66.1449 40.4028 37.9910 41.5349 46.3156 5.4442 26.1177 27.0147 4.4010 14.4288 1.0242 3.8915 5.3108 10.8250 7.6812 4.6983 2.9779
temp: 298.150 k
press: 1.00000 atm
elementType: 16 16 8 8 7 7 6 6 6 6 6 6 6 6 6 6 6 6 6 6 6 6 6 1 1 1 1 1 1 1 1 1 1 1 1 1 1 1 1 1 1
symmnumber: 1
zpe: 831760.4 jmol-1
zpe.correction: 0.316801 hartree
zpe.thermalcorrener: 0.338871 hartree
zpe.thermalcorrenthalpy: 0.339815 hartree
zpe.thermalcorrgfe: 0.261170 hartree
zpe.sumelectzpe: -1712.966112 hartree
zpe.sumelectthermal: -1712.944041 hartree
zpe.sumelectthermalent: -1712.943097 hartree
zpe.sumelectthermalfe: -1713.021742 hartree
dipole: -2.2878 4.4352 -2.9850
dipole: 5.8151
quadrupole: -138.1467 -143.1291 -149.8368
quadrupole: 8.7288 -12.5040 18.3685
quadrupole: 5.5575 0.5751 -6.1326 8.7288 -12.5040 18.3685
hfenergy: -1713.2829123 hartree
pointgroup: C01 [X(C17H18N2O2S2)]
dipole: 1.1574389 1.7719132 0.8688243 debye
polarizability: 271.3838504|-5.6942078|272.449598|-4.0312208|-7.4680288|191.6358538 unknown
InChI: InChI=1S/C17H18N2O2S2/c1-20-15-7-3-13(4-8-15)18-11-19(17(22)23-12-18)14-5-9-16(21-2)10-6-14/h3-10H,11-12H2,1-2H3
charge 0 multiplicity 1
41 atoms
S  0.609655 -3.860165 -0.267387
S  -1.703635 -2.851342 -1.897149
O  4.207713 2.449869 -1.352063
O  -4.821969 2.446012 -0.199838
N  1.404217 -1.670041 1.384319
N  -0.860063 -1.576881 0.381797
C  -0.019567 -1.452939 1.632585
C  1.706546 -3.06091 1.18229
C  2.113193 -0.659521 0.631925
C  -1.864368 -0.541329 0.184479
C  -0.729554 -2.613843 -0.522826
C  2.217282 0.650363 1.174591
C  2.727615 -0.93447 -0.612283
C  -1.463131 0.755865 -0.197043
C  -3.233046 -0.815628 0.428065
C  2.909875 1.658767 0.485642
C  3.447772 0.0688 -1.300994
C  3.534078 1.372331 -0.756426
C  -2.418083 1.788552 -0.335069
C  -4.19013 0.202572 0.291192
C  -3.785793 1.508401 -0.091534
C  4.865904 2.20448 -2.637703
C  -4.467048 3.802529 -0.625033
H  -0.205898 -0.443962 2.025941
H  -0.362803 -2.198956 2.374637
H  2.752459 -3.213493 0.883001
H  1.460943 -3.652847 2.076407
H  1.776464 0.869913 2.153471
H  2.621204 -1.924532 -1.068933
H  -0.405179 0.95674 -0.399974
H  -3.540055 -1.829051 0.703325
H  3.001172 2.667857 0.898675
H  3.910398 -0.17623 -2.261583
H  -2.087426 2.785998 -0.638277
H  -5.253183 0.012844 0.465878
H  4.134395 1.906367 -3.413872
H  5.648699 1.426216 -2.547232
H  5.327554 3.164148 -2.91217
H  -5.418863 4.352619 -0.652429
H  -4.007596 3.80014 -1.632468
H  -3.778548 4.283859 0.096767
