program: Gaussian 09
title: 000289109
version: EM64L-G09RevD.01
frameworkgroup: C1[X(C13H14N2O8)]
method: RPBEPBE
basis: SDD
operation: Freq
keyword: #p
keyword: freq=noraman
keyword: PBEPBE/SDD
title: #p freq=noraman PBEPBE/SDD
converged: YES YES NO NO
title: Mulliken charges:
elementType: O O O O O O O O N N C C C C C C C C C C C C C H H H H H H H H H H H H H H
charge: -0.254584 -0.263316 -0.435838 -0.393430 -0.221350 -0.213308 -0.211290 -0.231132 0.074431 0.017273 0.392163 -0.391719 0.201003 -0.541315 -0.456851 0.399068 -0.501903 -0.309851 -0.379333 0.020300 0.199755 0.128038 -0.540318 0.244053 0.228612 0.257387 0.272860 0.296504 0.265913 0.309252 0.255300 0.288753 0.227095 0.252462 0.252620 0.377532 0.385164
chargesum: 0.00000
title: Mulliken charges with hydrogens summed into heavy atoms:
elementType: O O O O O O O O N N C C C C C C C C C C C C C
charge: -0.254584 -0.263316 -0.058306 -0.008266 -0.221350 -0.213308 -0.211290 -0.231132 0.074431 0.017273 0.392163 0.080946 0.201003 -0.244810 0.073397 0.399068 0.073262 -0.054552 -0.090580 0.020300 0.199755 0.128038 0.191859
polarizability: 2.78455167e+02 -2.43146751e+00 1.87400714e+02 2.69350029e+01 1.54818912e+01 1.41223600e+02
1716.lowfreq: -3.5008 -0.0008 -0.0008 -0.0006 2.9578 5.1427 13.7824 23.4341 34.8990
frequency: 13.5939 23.4197 34.8985 35.8206 43.7851 48.0942 65.0401 88.1156 90.1951 107.7186 113.5261 146.8003 155.6753 166.5940 194.1164 213.8676 224.1093 226.2910 262.8548 286.3973 297.7942 313.0505 340.3452 357.1922 389.9811 420.9299 463.3481 477.5312 498.6993 504.5691 523.8909 536.0436 549.4696 585.2852 602.5173 609.2657 619.0673 631.3451 640.8080 696.4258 723.4591 732.1282 743.4580 764.7330 770.5963 817.2783 829.6541 884.3904 897.3726 912.6493 929.6657 953.3385 972.6412 978.1933 987.9896 994.6475 1029.2973 1043.8995 1079.9471 1088.8248 1118.4773 1133.0048 1150.1943 1156.1528 1184.5314 1198.4804 1216.2647 1220.9685 1248.0017 1249.4562 1272.4828 1285.0981 1303.1554 1342.1420 1361.2052 1364.3300 1377.8703 1409.5913 1430.5450 1443.8244 1446.2174 1453.3234 1463.5941 1469.6343 1473.9658 1489.1532 1543.2582 1593.4483 1614.5194 1616.0316 1677.5348 2981.2091 3002.5547 3021.2511 3029.4467 3065.8668 3083.2025 3091.2747 3110.8212 3140.4742 3167.9838 3170.4200 3186.8609 3508.0665 3515.6203
redmass: 7.9710 8.9565 12.2191 7.4621 11.0352 7.5815 7.2634 4.1428 4.6563 4.8521 3.6448 3.8854 6.1305 5.1059 3.0895 4.5638 2.5274 1.5876 9.4866 3.6795 5.0314 5.4100 4.9007 5.4611 5.8500 5.4077 5.4287 3.9594 2.8461 2.6913 3.1043 3.6006 4.1177 3.8701 4.9572 2.0255 5.3211 3.8842 1.3458 6.0948 5.5865 5.4200 5.5015 5.6850 2.0575 3.0504 1.5827 4.8289 8.8317 4.0964 2.0986 2.8609 7.9749 1.3776 1.8448 3.6808 2.9520 2.7288 2.5017 1.9225 1.2593 1.6247 1.4888 1.5011 1.1216 2.3248 1.5884 4.9874 1.6146 2.9911 1.4021 1.1391 1.6122 1.4071 7.0442 2.5080 1.9761 8.7138 2.0279 1.4709 1.1590 1.1013 1.1259 1.1522 1.0540 2.4091 9.3895 8.4310 7.0748 8.7501 8.0749 1.0319 1.0627 1.0570 1.0618 1.0970 1.1054 1.1087 1.1006 1.1011 1.0885 1.0925 1.0967 1.0639 1.0641
irintensity: 0.6108 0.6111 0.7421 1.5478 0.3731 0.2463 0.1967 0.0244 1.0889 2.2480 4.2407 9.8412 7.0298 0.2092 1.7665 0.9629 2.4761 1.3984 0.2883 2.3430 6.6003 1.3536 1.4151 0.4122 2.2922 8.0481 12.2012 16.3490 30.9526 47.3941 24.4868 31.9306 5.4001 15.7698 11.6328 86.3981 18.8958 74.0370 130.2520 22.9874 29.9084 0.4403 9.0056 9.9330 22.7566 11.0717 44.6922 30.4379 173.1034 18.7060 154.3121 89.1699 50.5432 2.9883 0.9860 71.8698 122.9684 300.4959 73.9617 56.3761 2.5109 59.5461 51.7530 8.7224 23.8336 93.8073 38.7529 366.2869 19.4878 133.5033 24.7639 3.6484 82.7585 12.0647 107.2577 22.6442 65.8955 19.1342 14.2827 5.5750 8.8756 49.1861 67.2105 14.4820 15.8599 37.0029 44.0375 25.8220 94.6207 325.0827 224.7786 43.4164 14.2202 33.5839 6.3504 3.6230 25.7691 7.9464 0.8362 13.5498 2.9358 3.2875 4.2685 20.5558 49.0160
temp: 298.150 k
press: 1.00000 atm
elementType: 8 8 8 8 8 8 8 8 7 7 6 6 6 6 6 6 6 6 6 6 6 6 6 1 1 1 1 1 1 1 1 1 1 1 1 1 1
symmnumber: 1
zpe: 700498.1 jmol-1
zpe.correction: 0.266806 hartree
zpe.thermalcorrener: 0.289758 hartree
zpe.thermalcorrenthalpy: 0.290702 hartree
zpe.thermalcorrgfe: 0.210570 hartree
zpe.sumelectzpe: -1213.232209 hartree
zpe.sumelectthermal: -1213.209257 hartree
zpe.sumelectthermalent: -1213.208312 hartree
zpe.sumelectthermalfe: -1213.288444 hartree
dipole: 2.0684 3.4987 5.8288
dipole: 7.1059
quadrupole: -170.4192 -116.8295 -135.9675
quadrupole: -16.3232 -4.9161 5.6881
quadrupole: -29.3471 24.2425 5.1046 -16.3232 -4.9161 5.6881
hfenergy: -1213.4990145 hartree
pointgroup: C01 [X(C13H14N2O8)]
dipole: 0.689998 -1.5993883 -2.1867201 debye
polarizability: 273.5847611|2.2428927|190.2369932|-37.3993568|9.3168486|143.257726 unknown
InChI: InChI=1S/C13H14N2O8/c1-22-11-4-2-9(15(20)21)6-8(11)7-23-14-10(13(18)19)3-5-12(16)17/h2,4,6,16,18H,3,5,7H2,1H3
charge 0 multiplicity 1
37 atoms
O  0.70217 1.094908 -0.177245
O  -0.525213 -1.098129 -1.812965
O  1.750458 -3.53108 0.573713
O  4.242632 2.826843 -1.336954
O  2.598083 -2.410777 2.423525
O  -5.87142 0.003806 1.5130
O  -4.880592 2.060283 1.566484
O  5.390248 1.228443 -0.102572
N  1.908211 1.722102 -0.670848
N  -4.907637 0.814816 1.21836
C  -1.617355 0.670336 -0.64171
C  -0.459564 1.568445 -0.995436
C  -1.622002 -0.700681 -1.058898
C  -2.701997 1.150806 0.109064
C  2.93284 0.044283 0.912542
C  -3.773185 0.288498 0.437529
C  2.533692 -1.281783 0.214924
C  -2.696299 -1.560566 -0.709982
C  -3.777412 -1.064355 0.038926
C  2.966788 1.183285 -0.084842
C  2.325205 -2.406005 1.205726
C  4.300513 1.722966 -0.488227
C  -0.441345 -2.501188 -2.259117
H  -0.173765 1.48487 -2.057615
H  -0.664723 2.622965 -0.742651
H  2.189498 0.269946 1.69819
H  3.919824 -0.056864 1.389178
H  -2.732982 2.188954 0.452368
H  3.319555 -1.600242 -0.497312
H  1.605305 -1.151184 -0.368268
H  -2.69495 -2.609393 -1.016933
H  -4.619739 -1.702105 0.319633
H  -1.320176 -2.775342 -2.871273
H  -0.336169 -3.1777 -1.391877
H  0.469501 -2.544686 -2.872322
H  1.659872 -4.260619 1.246036
H  5.173936 3.106144 -1.552252
