program: Gaussian 09
title: 000289098
version: EM64L-G09RevD.01
frameworkgroup: C1[X(C18H18Br2N2O2)]
method: RPBEPBE
basis: SDD
operation: Freq
keyword: #p
keyword: freq=noraman
keyword: PBEPBE/SDD
title: #p freq=noraman PBEPBE/SDD
converged: YES YES NO NO
title: Mulliken charges:
elementType: Br Br O O N N C C C C C C C C C C C C C C C C C C H H H H H H H H H H H H H H H H H H
charge: -0.003131 -0.003131 -0.271509 -0.271509 -0.085347 -0.085347 0.244607 0.244606 0.251206 0.251206 -0.343747 -0.343748 -0.277726 -0.277727 -0.245490 -0.245490 -0.187741 -0.187739 -0.234783 -0.234783 -0.350006 -0.350006 -0.681759 -0.681759 0.252753 0.252753 0.294988 0.294988 0.213027 0.213195 0.213026 0.213195 0.249999 0.249999 0.279836 0.279836 0.210702 0.235448 0.235477 0.210702 0.235448 0.235478
chargesum: 0.00000
title: Mulliken charges with hydrogens summed into heavy atoms:
elementType: Br Br O O N N C C C C C C C C C C C C C C C C C C
charge: -0.003131 -0.003131 -0.271509 -0.271509 -0.085347 -0.085347 0.244607 0.244606 0.251206 0.251206 -0.090994 -0.090994 0.017262 0.017261 0.180732 0.180731 0.062259 0.062260 -0.234783 -0.234783 -0.070170 -0.070170 -0.000132 -0.000131
polarizability: 5.21394045e+02 -1.81481282e+01 3.55619183e+02 -3.06738111e-02 -3.92975690e-02 1.08889906e+02
1716.lowfreq: -2.3835 -0.0007 -0.0006 0.0003 2.6700 4.7342 8.3496 21.8631 29.8148
frequency: 8.3496 21.8631 29.8148 50.1044 52.8349 53.2183 81.7058 82.1046 107.4326 115.3368 119.3613 121.5185 128.5414 153.3416 171.2161 176.6302 201.3328 233.0597 233.9218 242.2884 243.7185 247.2400 249.6721 292.3264 303.0119 345.2289 359.4776 363.0845 373.7526 418.6238 423.9596 471.8798 488.6626 521.5642 556.0887 565.1729 568.1896 621.3214 624.2217 629.6989 665.6114 731.8575 738.3892 764.7670 771.9872 801.4686 801.5746 832.5461 832.5809 880.4980 889.6085 903.8134 908.8257 924.2749 925.2682 940.9052 942.0957 977.0325 985.7827 996.2278 1032.6220 1033.0703 1072.8148 1073.8170 1113.2189 1114.8221 1121.1084 1125.6068 1135.6402 1135.6422 1196.7899 1199.6110 1226.0293 1233.9656 1261.0429 1261.0488 1263.4491 1263.4531 1293.0554 1330.8439 1364.2880 1366.2284 1379.0374 1381.5172 1401.3522 1402.9544 1403.0072 1407.1538 1457.9033 1459.2744 1462.2613 1462.2661 1478.7415 1478.7820 1489.8498 1490.1294 1496.4081 1560.1553 1570.1346 1589.8638 1592.7837 1593.3153 2961.8537 2961.9655 2999.6293 2999.6414 3022.5675 3022.5896 3085.4392 3088.6650 3096.5826 3096.6188 3109.9152 3109.9324 3159.1666 3159.2728 3172.9173 3172.9496 3178.8918 3178.9050
redmass: 7.5972 7.7435 6.1249 4.4297 3.9444 15.5567 4.2815 2.8565 2.2900 4.3935 2.5752 3.6500 3.7059 4.8774 3.0573 8.4343 5.9085 8.2672 7.5492 1.5178 1.1958 2.2162 4.9354 5.0193 8.7894 4.5620 4.4189 4.7904 4.5465 6.4836 5.2479 3.0518 3.3238 5.2714 3.8782 5.4518 4.4617 6.4773 7.3149 6.2814 6.0310 3.3398 3.3620 4.6042 4.6987 1.4637 1.4762 1.1253 1.1263 4.9544 4.1051 3.6030 4.0483 1.3807 1.3942 1.3473 1.3570 7.2479 1.5268 1.5118 2.7626 2.7589 1.9790 2.0026 2.4897 2.3341 2.1563 2.0326 1.4349 1.4349 1.5807 1.6522 3.9148 3.3056 1.3435 1.3443 1.1408 1.1408 1.4867 2.0188 1.5771 1.4425 3.9351 4.0029 3.8916 1.2920 1.2771 4.4504 2.2655 2.5283 1.0392 1.0392 1.0856 1.0906 1.1788 1.1236 4.2598 8.1125 7.8267 6.6868 7.0129 7.0345 1.0554 1.0554 1.0365 1.0365 1.1079 1.1079 1.0887 1.0896 1.0988 1.0988 1.1016 1.1016 1.0880 1.0879 1.0925 1.0925 1.0967 1.0967
irintensity: 0.9764 0.4399 4.1346 0.0000 0.0154 0.0000 0.0000 0.0002 2.8267 1.1530 0.0002 0.0000 0.0003 8.9264 0.0000 0.7994 0.0002 0.0000 4.8710 2.7888 0.0000 22.5204 0.0283 2.4830 0.0011 0.1093 5.2840 0.0001 0.0000 0.2431 0.0000 24.9569 0.0000 29.8409 8.8679 0.0005 0.0001 0.0000 51.4458 0.0001 38.6299 1.7274 0.0006 0.0001 25.8412 110.5408 0.0014 0.6393 0.0002 98.2346 0.0004 39.9070 0.0001 9.7704 0.0006 2.0162 0.0003 0.0039 47.5030 0.0000 152.2379 0.0014 3.2994 0.0000 74.1133 0.0002 154.4435 0.0010 0.0531 10.1783 68.3409 0.0001 594.9643 0.0006 1.5024 117.4654 0.0010 0.0280 47.3730 0.0000 22.9015 0.0000 108.4688 0.0001 79.9058 102.5290 0.2541 0.0001 339.1214 0.0012 0.0163 25.7246 16.4050 0.0012 0.0000 3.5549 0.0001 0.3455 0.0000 92.0163 0.0001 138.7501 116.2100 0.0006 41.2642 0.8235 0.0389 63.1981 20.8545 0.0025 62.1838 0.5587 0.9746 61.3009 0.0323 13.4027 2.2724 0.0010 25.2564 0.3340
temp: 298.150 k
press: 1.00000 atm
elementType: 35 35 8 8 7 7 6 6 6 6 6 6 6 6 6 6 6 6 6 6 6 6 6 6 1 1 1 1 1 1 1 1 1 1 1 1 1 1 1 1 1 1
symmnumber: 1
zpe: 835104.4 jmol-1
zpe.correction: 0.318074 hartree
zpe.thermalcorrener: 0.342872 hartree
zpe.thermalcorrenthalpy: 0.343816 hartree
zpe.thermalcorrgfe: 0.258572 hartree
zpe.sumelectzpe: -981.788353 hartree
zpe.sumelectthermal: -981.763555 hartree
zpe.sumelectthermalent: -981.762611 hartree
zpe.sumelectthermalfe: -981.847855 hartree
dipole: 0.0000 0.0000 0.0191
dipole: 0.0191
quadrupole: -138.3453 -124.4995 -164.8835
quadrupole: -47.3653 0.0075 -0.0043
quadrupole: 4.2308 18.0766 -22.3074 -47.3653 0.0075 -0.0043
hfenergy: -982.106427 hartree
pointgroup: C01 [X(C18H18Br2N2O2)]
dipole: -0.0000062 -0.0000051 0.0074981 debye
polarizability: 517.9832862|29.7176607|359.0299421|-0.0183096|-0.0463674|108.8899065 unknown
InChI: InChI=1S/C18H18Br2N2O2/c1-3-23-17-7-5-15(19)9-13(17)11-21-22-12-14-10-16(20)6-8-18(14)24-4-2/h5-12H,3-4H2,1-2H3
charge 0 multiplicity 1
42 atoms
Br -4.853787 -3.951921 -0.251823
Br 4.852521 3.951303 -0.253519
O  -3.859766 2.144993 -0.250902
O  3.858466 -2.145605 -0.250396
N  -0.613923 -0.367256 -0.253749
N  0.612636 0.366655 -0.254065
C  -4.150754 0.778139 -0.250561
C  4.149463 -0.778753 -0.250529
C  -3.021788 -0.104444 -0.252278
C  3.020501 0.103836 -0.252628
C  -5.466418 0.252177 -0.249043
C  5.465129 -0.252797 -0.249143
C  -3.248916 -1.508796 -0.252765
C  3.247635 1.508186 -0.253616
C  -4.985512 3.106039 -0.245522
C  4.984204 -3.106657 -0.244556
C  -5.673885 -1.143916 -0.249166
C  5.672602 1.143295 -0.249771
C  -4.558227 -2.008393 -0.25106
C  4.556949 2.007777 -0.252039
C  -1.661901 0.438806 -0.25314
C  1.660612 -0.439409 -0.253364
C  -4.371269 4.502383 -0.245461
C  4.36995 -4.502997 -0.243995
H  -6.337349 0.91227 -0.247885
H  6.336057 -0.912893 -0.247697
H  -2.375333 -2.166368 -0.254498
H  2.374056 2.165761 -0.255642
H  -5.610992 2.938515 -1.145895
H  -5.605289 2.935566 0.658172
H  5.609753 -2.939496 -1.144949
H  5.603914 -2.93583 0.659117
H  -6.690812 -1.546174 -0.247976
H  6.689532 1.545548 -0.24868
H  -1.53832 1.532027 -0.25383
H  1.537027 -1.53263 -0.253461
H  -5.17054 5.265537 -0.244102
H  -3.742708 4.652902 0.648407
H  -3.745329 4.653506 -1.141083
H  5.169216 -5.266156 -0.242313
H  3.741345 -4.653176 0.649898
H  3.744054 -4.654451 -1.139592
