program: Gaussian 09
title: 000289054
version: EM64L-G09RevD.01
frameworkgroup: C1[X(C12H12ClN3O3)]
method: RPBEPBE
basis: SDD
operation: Freq
keyword: #p
keyword: freq=noraman
keyword: PBEPBE/SDD
title: #p freq=noraman PBEPBE/SDD
converged: YES YES NO NO
title: Mulliken charges:
elementType: Cl O O O N N N C C C C C C C C C C C C H H H H H H H H H H H H
charge: -0.056861 -0.200725 -0.240878 -0.263601 -0.406651 -0.186289 -0.608828 0.033380 0.173177 0.530038 -0.746139 0.212357 -0.507162 -0.376584 -0.408424 -0.239444 -0.216949 0.285462 -0.114315 0.326315 0.242010 0.253428 0.220590 0.279854 0.279464 0.305573 0.246687 0.261085 0.253925 0.344015 0.325490
chargesum: 0.00000
title: Mulliken charges with hydrogens summed into heavy atoms:
elementType: Cl O O O N N N C C C C C C C C C C C C
charge: -0.056861 -0.200725 -0.240878 -0.263601 -0.080336 -0.186289 0.060676 0.033380 0.173177 0.530038 -0.030111 0.212357 0.052156 -0.071011 -0.161737 0.021641 0.036976 0.285462 -0.114315
polarizability: 2.24285116e+02 1.36871498e-02 1.57210629e+02 -5.66754381e+00 7.91439817e+00 1.13333715e+02
1716.lowfreq: -6.5912 -1.6277 -0.0027 -0.0027 -0.0025 3.0338 19.7522 32.0465 46.7500
frequency: 19.3800 32.0128 46.7472 51.2159 71.8121 89.6715 121.9073 137.3745 187.0618 224.9894 237.1231 252.2891 279.1271 288.3373 299.9618 323.3899 343.1566 346.3730 408.6940 433.1767 437.6734 453.5590 487.5846 509.6735 527.5802 531.4975 569.0841 618.6164 624.2411 629.4974 647.5374 671.1721 703.0667 717.0296 738.2961 743.8716 807.8665 823.7650 830.1783 851.3078 896.5509 942.6866 956.0812 991.6433 997.7573 1002.8550 1062.1138 1067.9539 1082.1251 1097.6670 1117.1788 1147.5548 1155.9931 1203.0962 1222.3592 1244.5769 1291.9504 1308.5716 1317.0955 1349.1407 1359.1761 1370.2375 1381.4459 1393.6010 1398.7287 1425.6335 1473.8112 1479.2717 1484.0113 1585.5397 1599.1480 1603.3033 1656.3238 1663.8382 1718.9513 2996.0373 3013.5857 3080.9133 3095.2097 3107.3077 3117.6936 3153.8938 3170.2132 3174.8942 3518.4286 3605.9657 3669.7829
redmass: 4.0753 4.8670 7.8971 7.4852 7.9280 7.5256 9.4522 8.8204 6.5272 3.5687 3.0411 3.3260 1.5588 2.3122 5.2022 7.4275 6.1095 3.9698 2.9189 4.3615 4.4514 1.5089 1.4731 2.6694 2.6798 1.5655 5.8403 6.2854 7.0082 1.8036 2.8030 6.9856 8.5206 6.0542 4.1490 6.5459 3.4873 2.4616 1.6217 1.3918 2.6764 1.9670 1.3910 2.0132 2.2652 2.7070 1.9449 3.4956 1.9872 2.2889 1.9643 2.5726 3.0458 1.1610 3.5700 3.3932 1.7804 1.3032 1.6483 1.8158 2.4132 5.8273 2.5357 1.7564 2.6327 1.1650 1.0619 1.2778 1.6271 7.2021 5.6941 1.3771 6.0920 6.0112 10.0020 1.0353 1.0581 1.1035 1.1004 1.1009 1.0936 1.0878 1.0945 1.0967 1.0450 1.0801 1.1044
irintensity: 4.0034 0.7455 1.0865 0.3640 6.9668 7.1285 0.7278 5.1075 0.7153 2.7880 3.3211 4.0650 1.9988 3.2863 12.2171 3.0695 2.6095 1.0703 1.1081 29.8870 3.6865 4.5775 125.3728 45.4312 22.0949 177.3563 18.8496 22.6569 1.1338 48.4643 48.4605 7.7185 6.5762 3.5413 18.9466 42.7237 5.3676 5.4025 19.8531 25.2255 39.9122 0.0679 0.7314 19.8685 40.7632 18.3071 0.3410 3.1449 48.9884 23.1608 6.1685 19.4477 34.6451 0.1645 20.2223 84.3598 90.2738 0.5706 56.1988 23.2414 89.2740 16.9625 103.9356 60.7607 17.2095 105.4502 13.3369 41.7590 50.6761 2.7153 24.7337 44.7565 371.3892 570.7731 225.9348 14.1627 18.4128 0.0149 21.7978 14.6462 29.4974 4.0581 2.5416 6.5318 49.9890 50.6255 30.8058
temp: 298.150 k
press: 1.00000 atm
elementType: 17 8 8 8 7 7 7 6 6 6 6 6 6 6 6 6 6 6 6 1 1 1 1 1 1 1 1 1 1 1 1
symmnumber: 1
zpe: 603329.4 jmol-1
zpe.correction: 0.229796 hartree
zpe.thermalcorrener: 0.247643 hartree
zpe.thermalcorrenthalpy: 0.248587 hartree
zpe.thermalcorrgfe: 0.181961 hartree
zpe.sumelectzpe: -1313.146000 hartree
zpe.sumelectthermal: -1313.128153 hartree
zpe.sumelectthermalent: -1313.127209 hartree
zpe.sumelectthermalfe: -1313.193835 hartree
dipole: -3.5910 -1.2631 -0.9062
dipole: 3.9130
quadrupole: -101.9682 -99.6389 -131.0510
quadrupole: -20.9807 11.7746 -2.9668
quadrupole: 8.9178 11.2472 -20.1650 -20.9807 11.7746 -2.9668
hfenergy: -1313.3757957 hartree
pointgroup: C01 [X(C12H12Cl1N3O3)]
dipole: 1.3561294 0.6411421 -0.3462634 debye
polarizability: 222.4259856|9.4095679|156.8722883|10.9316631|-10.1801952|115.5311865 unknown
InChI: InChI=1S/C12H12ClN3O3/c1-12(7-2-4-8(13)5-3-7)10(18)16(6-9(14)17)11(19)15-12/h2-5,15H,6,14H2,1H3
charge 0 multiplicity 1
31 atoms
Cl -5.040299 -2.233897 0.096699
O  1.054072 0.529718 -2.193999
O  2.475193 1.116864 2.252767
O  1.875319 -2.04157 0.400846
N  0.448037 1.688491 1.131926
N  2.060451 0.673598 -0.057965
N  4.097839 -2.421564 -0.15459
C  -0.15148 1.540919 -0.22085
C  1.02372 0.844554 -0.982321
C  -1.386424 0.614813 -0.177011
C  -0.409647 2.918423 -0.872604
C  1.720485 1.16358 1.252345
C  3.25553 -0.109702 -0.299275
C  -1.224742 -0.722669 0.276383
C  -2.674148 1.058303 -0.559055
C  -2.330422 -1.592753 0.359676
C  -3.792935 0.197476 -0.477626
C  2.997664 -1.608473 0.019073
C  -3.602549 -1.115752 -0.013957
H  -0.065251 2.037695 1.938938
H  0.513957 3.520901 -0.847659
H  -0.714283 2.78967 -1.925001
H  -1.194643 3.475119 -0.331421
H  3.542462 0.001603 -1.360401
H  4.065194 0.273276 0.347521
H  -0.231783 -1.105588 0.544987
H  -2.828406 2.074806 -0.932122
H  -2.201246 -2.623468 0.701781
H  -4.787732 0.5431 -0.772819
H  4.002372 -3.418937 0.03592
H  5.002195 -2.060336 -0.454186
