program: Gaussian 09
title: 000289057
version: EM64L-G09RevD.01
frameworkgroup: C1[X(C11H14N2O4)]
method: RPBEPBE
basis: SDD
operation: Freq
keyword: #p
keyword: freq=noraman
keyword: PBEPBE/SDD
title: #p freq=noraman PBEPBE/SDD
converged: YES YES NO NO
title: Mulliken charges:
elementType: O O O O N N C C C C C C C C C C C H H H H H H H H H H H H H H
charge: -0.213915 -0.236873 -0.407838 -0.224019 -0.496119 -0.202077 0.314638 -0.193005 -0.192231 -0.489912 -0.508266 -0.482280 -0.512975 0.193015 0.185814 -0.447883 0.229700 0.262066 0.256300 0.238317 0.241947 0.249282 0.211504 0.237461 0.247766 0.210764 0.248569 0.320563 0.285858 0.286125 0.387700
chargesum: 0.00000
title: Mulliken charges with hydrogens summed into heavy atoms:
elementType: O O O O N N C C C C C C C C C C C
charge: -0.213915 -0.236873 -0.020138 -0.224019 -0.175556 -0.202077 0.314638 0.069062 0.064069 -0.009648 -0.047480 0.002948 -0.053641 0.193015 0.185814 0.124100 0.229700
polarizability: 1.57692643e+02 -6.38991899e+00 1.26556488e+02 -6.27073752e-01 -1.40882154e+00 1.21693817e+02
1716.lowfreq: -9.4736 -6.6311 -0.0004 -0.0003 0.0001 7.9835 15.1616 39.0280 49.6117
frequency: 13.6584 39.0026 49.6096 60.9670 72.7526 77.0956 114.5341 146.3028 149.9943 163.2727 232.3533 281.6514 300.9961 310.5669 313.1333 340.5134 373.3042 463.8607 472.5415 477.2486 524.7938 536.0737 560.6264 611.3871 641.5699 674.7537 678.2517 714.9523 740.5677 775.8160 778.4491 812.8708 814.6681 823.5881 844.5424 853.7441 894.5153 911.1684 925.7180 970.0843 1016.3360 1029.2390 1040.3766 1047.6395 1068.1182 1069.5005 1074.6953 1090.3959 1094.3688 1101.9129 1108.8633 1139.0692 1160.1407 1165.4034 1187.0615 1210.6883 1228.9114 1254.9563 1302.5990 1320.0758 1344.0035 1355.6550 1360.3149 1364.2294 1392.2865 1419.1475 1439.9586 1441.8143 1469.2032 1474.3497 1656.7545 1671.1489 1718.8913 3021.6601 3090.3488 3093.5598 3094.9824 3103.1666 3104.9535 3124.0077 3129.7874 3190.5446 3191.5073 3210.2210 3211.7383 3523.4386 3611.2217
redmass: 5.3906 5.2469 7.8324 3.2150 3.0223 6.8326 5.5163 5.8010 2.6440 3.8509 2.5944 4.9108 5.4888 5.7986 8.4418 3.1613 3.4547 3.6662 1.3316 1.8340 3.9845 3.0596 3.9812 7.6005 1.5603 6.4964 3.4292 6.8962 4.4467 1.1220 1.1558 1.5652 2.7590 1.3056 3.9789 3.4835 2.9381 3.7654 3.9837 3.6806 1.7615 2.9016 1.2260 1.2401 1.4235 1.4114 1.9134 2.4481 1.8147 1.1810 1.1797 3.9066 1.4046 1.4305 2.4568 1.6601 2.3429 3.2204 2.3973 1.5815 1.4772 1.8299 1.9952 1.6963 3.6777 1.1576 1.0888 1.0938 1.3254 1.3506 11.7812 9.4786 9.9536 1.0605 1.1007 1.0534 1.0530 1.0608 1.0604 1.0902 1.0903 1.1157 1.1159 1.1144 1.1144 1.0641 1.0795
irintensity: 0.0213 0.1691 2.2505 0.3135 0.2380 0.3180 0.2955 4.8123 1.0763 0.3009 5.9494 2.2608 4.1689 0.7315 7.9191 6.8566 0.4465 15.6008 82.6360 70.3658 20.6082 15.5579 39.7472 29.6864 114.3400 2.1427 2.5515 17.2047 23.5666 3.6307 7.0722 3.1903 30.6129 13.3804 1.7588 14.0298 25.1543 13.1871 12.0359 18.3375 3.9488 21.4637 49.3738 25.3822 2.7057 22.2472 141.9973 19.6794 1.1460 0.2664 0.3713 32.5242 0.7714 3.3893 0.2195 1.7235 53.7792 35.5152 38.5961 27.6802 26.8130 52.0748 6.6286 9.8566 179.8853 62.2883 7.0054 22.6198 1.8541 3.8212 545.0856 312.8516 205.7794 11.7495 1.9003 4.2934 34.3869 10.9529 6.2065 0.1886 5.2131 0.9010 4.8741 18.4531 26.7868 32.7471 33.6385
temp: 298.150 k
press: 1.00000 atm
elementType: 8 8 8 8 7 7 6 6 6 6 6 6 6 6 6 6 6 1 1 1 1 1 1 1 1 1 1 1 1 1 1
symmnumber: 1
zpe: 634384.1 jmol-1
zpe.correction: 0.241624 hartree
zpe.thermalcorrener: 0.258284 hartree
zpe.thermalcorrenthalpy: 0.259228 hartree
zpe.thermalcorrgfe: 0.195091 hartree
zpe.sumelectzpe: -836.668514 hartree
zpe.sumelectthermal: -836.651854 hartree
zpe.sumelectthermalent: -836.650910 hartree
zpe.sumelectthermalfe: -836.715047 hartree
dipole: -4.1018 1.7444 0.3743
dipole: 4.4730
quadrupole: -101.3053 -91.5698 -112.0871
quadrupole: 4.5456 1.5215 2.7418
quadrupole: 0.3487 10.0843 -10.4330 4.5456 1.5215 2.7418
hfenergy: -836.9101382 hartree
pointgroup: C01 [X(C11H14N2O4)]
dipole: 1.6449872 -0.606851 0.1508405 debye
polarizability: 158.2454629|-4.8116026|125.9285212|0.8161789|1.4803087|121.7689639 unknown
InChI: InChI=1S/C11H14N2O4/c14-8(15)5-13-9(16)11(6-1-2-6,7-3-4-7)12-10(13)17/h6-7,12,14H,1-5H2
charge 0 multiplicity 1
31 atoms
O  -0.339902 0.21318 -2.107733
O  -0.888808 0.957422 2.503862
O  -2.68247 -1.373121 0.103394
O  -4.465746 -0.067315 -0.620724
N  0.965174 0.197698 1.209859
N  -0.944674 0.689654 0.130204
C  1.283408 -0.071979 -0.204915
C  2.379232 0.845932 -0.774638
C  1.61249 -1.548416 -0.488463
C  2.559032 2.289079 -0.296527
C  3.623686 1.227164 0.033797
C  0.876441 -2.688466 0.217445
C  2.362547 -2.427916 0.519389
C  -0.072146 0.279389 -0.88557
C  -0.329717 0.641023 1.427014
C  -2.342084 1.033157 -0.059606
C  -3.282634 -0.160816 -0.238362
H  2.527036 0.66993 -1.846182
H  1.849095 -1.707888 -1.546369
H  1.932655 2.639461 0.529861
H  2.793986 3.05149 -1.043782
H  4.58282 1.263678 -0.48964
H  3.702664 0.898324 1.07542
H  0.608499 -3.567062 -0.375214
H  0.150551 -2.425571 0.992758
H  2.611099 -2.018193 1.503945
H  3.109787 -3.125039 0.130717
H  1.618056 0.083031 1.981663
H  -2.461526 1.679033 -0.945694
H  -2.678849 1.59356 0.83233
H  -3.338304 -2.111121 -0.02394
