program: Gaussian 09
title: 000289060
version: EM64L-G09RevD.01
frameworkgroup: C1[X(C15H18N2O4)]
method: RPBEPBE
basis: SDD
operation: Freq
keyword: #p
keyword: freq=noraman
keyword: PBEPBE/SDD
title: #p freq=noraman PBEPBE/SDD
converged: YES YES NO NO
title: Mulliken charges:
elementType: O O O O N N C C C C C C C C C C C C C C C H H H H H H H H H H H H H H H H H H
charge: -0.220982 -0.242656 -0.275507 -0.237095 -0.186350 -0.444278 0.032610 0.214140 0.471966 -0.697844 0.186162 -0.401113 -0.470342 -0.355764 -0.407341 -0.251399 -0.233846 0.271540 -0.245926 -0.249893 -0.669558 0.326363 0.245102 0.235244 0.231838 0.259488 0.255543 0.237892 0.259470 0.249057 0.250674 0.230642 0.230870 0.233857 0.239028 0.241153 0.215609 0.223169 0.248479
chargesum: 0.00000
title: Mulliken charges with hydrogens summed into heavy atoms:
elementType: O O O O N N C C C C C C C C C C C C C C C
charge: -0.220982 -0.242656 -0.275507 -0.237095 -0.186350 -0.117916 0.032610 0.214140 0.471966 0.014341 0.186162 0.113917 0.027021 -0.106708 -0.156667 -0.020757 -0.002976 0.271540 -0.012069 0.230288 0.017699
polarizability: 1.93134002e+02 -2.90943230e+01 1.73178819e+02 5.25250648e+00 -4.93618584e+00 1.65028213e+02
1716.lowfreq: -11.7021 -8.6426 -0.0006 -0.0004 -0.0002 6.3359 12.0177 15.2400 35.8692
frequency: 4.2891 14.4541 35.8287 40.8199 51.8051 63.7498 84.1007 91.4079 110.6389 131.5298 186.9709 201.4629 203.8447 210.8110 235.2323 257.3555 276.9166 289.4422 322.9490 331.1068 340.6273 374.0043 402.1799 441.0294 444.1511 482.3983 489.5454 525.2353 573.0254 586.3060 615.2674 643.5500 650.5700 680.9504 691.3476 703.3975 705.4795 729.3495 746.3518 778.6609 800.3978 808.3171 847.4063 852.8250 891.4125 922.2709 948.4430 955.6058 960.7136 978.2465 990.0977 997.7425 1017.0453 1024.4142 1033.9797 1069.7344 1081.0244 1094.7673 1097.1588 1124.6669 1153.9315 1156.6296 1164.3322 1174.2391 1194.2055 1217.8423 1241.2644 1252.8490 1275.3301 1291.7963 1319.5082 1341.9457 1351.6002 1353.8949 1359.3213 1378.3855 1380.9987 1388.0574 1393.0389 1434.0788 1447.9372 1453.4812 1456.3377 1463.0240 1464.6928 1471.6197 1482.8862 1484.2988 1590.6798 1609.6329 1641.0400 1653.4441 1713.5296 2991.0923 2995.4491 3027.5642 3034.0686 3035.7116 3086.1177 3093.7862 3095.3303 3095.6620 3107.4299 3111.3418 3124.4265 3127.5753 3137.3169 3150.4937 3158.8184 3169.3287 3603.8350
redmass: 3.3322 4.3910 4.3351 5.1084 5.9712 3.8745 7.4257 4.6151 5.1070 4.9981 4.9505 2.6243 1.4340 1.4776 1.8898 3.7941 2.4443 2.2721 5.7735 6.3914 3.8357 4.8673 2.8027 3.0080 2.7789 3.2379 1.2458 4.3618 4.9762 5.6152 6.3817 5.7535 3.5806 5.5799 6.3015 2.8904 2.3353 5.4656 2.6833 2.1124 2.1890 1.8443 2.6447 1.2525 3.0406 1.4401 2.1187 2.4086 2.0827 1.3849 5.6761 1.3336 3.1400 2.5293 3.2885 2.2385 1.7097 2.0859 1.9618 3.1625 2.9195 1.6825 3.2847 1.0569 1.1218 3.0986 3.3851 1.5112 1.1414 1.8005 1.3389 1.4028 1.6187 1.6430 1.5541 2.6835 3.2380 1.2380 1.4435 2.2001 1.1015 1.1119 1.0964 1.0440 1.1085 1.0577 2.0049 1.0532 6.1253 6.0478 9.0865 11.1872 9.7488 1.0359 1.0350 1.0587 1.0600 1.0606 1.0971 1.1051 1.1019 1.1016 1.1045 1.0996 1.1067 1.0849 1.0883 1.0924 1.0956 1.1009 1.0799
irintensity: 0.5002 0.3967 0.1216 0.3501 0.0808 1.3663 0.1699 0.5346 5.9566 0.4738 4.5169 2.5678 1.4930 1.3246 2.1011 1.3940 3.5313 6.1298 5.4802 9.3928 1.9764 14.8791 1.1838 3.7526 18.9780 9.1213 134.4112 21.8928 3.0848 6.8151 0.4802 8.8592 0.6021 7.3603 5.1295 14.0961 49.5816 13.3074 13.9632 48.8376 2.6938 1.3917 9.2633 1.5170 11.8697 3.4924 14.1429 14.5635 15.0793 0.8741 0.8812 0.0420 70.4051 33.4825 17.9116 7.2940 10.9282 32.8871 4.1039 34.2580 76.7238 13.6345 43.7471 0.1987 2.6841 6.0156 44.5615 54.0323 7.0655 87.8568 3.2825 50.4861 92.4191 50.1876 23.9180 49.2667 35.9911 25.6436 60.6751 20.3647 37.7100 33.9768 3.8856 14.2559 4.8358 15.9084 18.1975 11.4182 0.1077 4.3643 159.5649 528.9882 241.2992 19.4047 17.5808 17.2145 8.0090 13.5044 28.2447 3.1615 4.5141 22.9602 8.2839 12.4621 16.8332 0.2411 5.3830 18.9272 21.3354 12.6239 46.7666
temp: 298.150 k
press: 1.00000 atm
elementType: 8 8 8 8 7 7 6 6 6 6 6 6 6 6 6 6 6 6 6 6 6 1 1 1 1 1 1 1 1 1 1 1 1 1 1 1 1 1 1
symmnumber: 1
zpe: 814331.6 jmol-1
zpe.correction: 0.310163 hartree
zpe.thermalcorrener: 0.330895 hartree
zpe.thermalcorrenthalpy: 0.331839 hartree
zpe.thermalcorrgfe: 0.256438 hartree
zpe.sumelectzpe: -991.289077 hartree
zpe.sumelectthermal: -991.268345 hartree
zpe.sumelectthermalent: -991.267400 hartree
zpe.sumelectthermalfe: -991.342801 hartree
dipole: -4.0917 -0.7106 1.0666
dipole: 4.2877
quadrupole: -120.2478 -118.0096 -129.9304
quadrupole: -4.6080 0.0359 9.0070
quadrupole: 2.4814 4.7197 -7.2011 -4.6080 0.0359 9.0070
hfenergy: -991.599239 hartree
pointgroup: C01 [X(C15H18N2O4)]
dipole: 1.5662431 -0.4870737 -0.3941198 debye
polarizability: 200.2844812|25.1188777|165.5587556|7.1619064|4.7554303|165.4977975 unknown
InChI: InChI=1S/C15H18N2O4/c1-3-21-12(18)9-10-17-13(19)15(2,16-14(17)20)11-7-5-4-6-8-11/h4-8,16H,3,9-10H2,1-2H3
charge 0 multiplicity 1
39 atoms
O  -0.544146 -0.607864 2.058413
O  -2.065799 -2.219294 -2.092583
O  -1.126193 1.719304 -0.385319
O  -2.838265 2.607329 0.934583
N  -1.623696 -1.266675 0.054117
N  0.081632 -2.22799 -1.058259
C  0.698477 -1.777168 0.203475
C  -0.535004 -1.128027 0.917256
C  1.80248 -0.72064 -0.00503
C  1.200765 -2.981118 1.046004
C  -1.271312 -1.945251 -1.160241
C  -2.971037 -0.741277 0.295531
C  -3.245688 0.599935 -0.444653
C  2.5151 -0.216997 1.114469
C  2.109174 -0.221559 -1.294256
C  3.529075 0.749776 0.940873
C  3.129701 0.741516 -1.468116
C  -2.428907 1.75261 0.115509
C  3.847294 1.22784 -0.352207
C  -0.175674 2.748968 0.147889
C  -0.276326 4.044982 -0.660123
H  0.560473 -2.789682 -1.759395
H  1.491923 -2.648075 2.055228
H  0.402164 -3.736391 1.147562
H  2.07811 -3.44609 0.562677
H  -3.086151 -0.615787 1.385978
H  -3.696396 -1.491338 -0.064021
H  -4.312505 0.848755 -0.31652
H  -3.034865 0.463614 -1.518608
H  2.259908 -0.556433 2.123297
H  1.539337 -0.57052 -2.161224
H  4.067825 1.131909 1.814977
H  3.358133 1.113613 -2.473085
H  4.639208 1.972977 -0.486367
H  -0.409173 2.913768 1.214025
H  0.808503 2.266698 0.043812
H  0.491946 4.759885 -0.310902
H  -0.10546 3.853581 -1.73384
H  -1.266429 4.513616 -0.531627
