program: Gaussian 09
title: 000289077
version: EM64L-G09RevD.01
frameworkgroup: C1[X(C9F18N2)]
method: RPBEPBE
basis: SDD
operation: Freq
keyword: #pfreq=noraman
keyword: PBEPBE/SDD
title: #p freq=noraman PBEPBE/SDD
converged: YES YES NO NO
title: Mulliken charges:
elementType: F F F F F F F F F F F F F F F F F F N N C C C C C C C C C
charge: -0.111118 -0.101380 -0.131571 -0.111262 -0.101254 -0.131532 -0.131724 -0.111966 -0.133083 -0.116052 -0.119101 -0.147813 -0.132953 -0.112313 -0.131592 -0.119206 -0.147386 -0.116344 0.153386 0.153975 -0.237978 0.407887 0.408094 -0.088439 -0.089075 0.366469 0.383465 0.366828 0.383042
chargesum: 0.00000
title: Mulliken charges with hydrogens summed into heavy atoms:
polarizability: 1.43362955e+02 2.06608686e-03 1.28605711e+02 -1.40433379e+00 1.18667734e-02 1.04401109e+02
1716.lowfreq: -4.1896 -0.0004 -0.0002 0.0003 4.9521 11.5849 25.5860 30.2839 38.5293
frequency: 25.5857 30.2810 38.5284 39.7590 40.8576 57.9843 60.1491 70.0578 71.5568 81.1954 85.8760 104.9711 130.6391 133.7839 142.6625 155.4516 165.0025 165.1930 184.0144 227.5683 233.5607 242.3088 253.2815 263.0064 267.6105 269.1616 273.2469 290.8617 296.1666 300.8030 362.5628 402.7710 403.8325 432.6314 433.3625 440.4366 440.9338 459.9544 460.1472 464.1272 473.3737 475.2670 488.8390 494.8772 510.0553 525.8316 611.4591 613.2955 624.2363 638.2833 638.7348 662.7222 698.2068 712.8754 714.2120 723.6489 870.2558 874.5440 889.4459 969.6532 969.9135 986.4603 998.6028 1007.8738 1018.1231 1028.1971 1047.4814 1049.1892 1062.4177 1088.9418 1096.4541 1105.9814 1111.7241 1117.7258 1118.5258 1121.3283 1149.6102 1205.2719 1209.4718 1714.4926 1726.7394
redmass: 18.6673 18.3175 18.4154 18.4432 18.5024 18.7900 18.0342 18.2182 18.8681 18.3556 17.5817 17.8802 18.1706 17.4959 17.8293 17.8139 17.4620 17.2669 17.8172 17.6307 17.6013 17.9465 17.9005 18.1385 18.2144 18.2222 18.2813 18.3545 18.3574 18.4840 15.3312 15.8805 15.7395 17.0214 16.7897 17.2371 17.2779 17.7746 17.7538 17.8137 17.7301 17.7641 17.8486 17.3175 16.9226 15.3842 16.0563 15.8699 16.5818 16.7426 16.4926 17.4887 16.1739 13.6657 13.4690 15.2807 14.1131 14.1003 13.6040 12.7871 13.0575 13.3133 13.1323 13.1075 13.1138 13.1137 13.0719 13.0121 12.9931 12.9007 12.6157 12.8732 12.8259 12.6846 12.8094 12.7467 12.5650 12.2283 12.2649 12.8430 12.8744
irintensity: 0.0179 0.0017 0.1786 0.2371 0.0099 0.0153 0.0423 0.0025 0.0884 0.0180 0.2819 0.6339 0.2648 0.0141 2.2960 4.1511 0.0344 3.1386 1.0919 0.0008 0.2914 0.8843 1.6809 0.5992 0.0319 4.0481 0.0215 2.1746 0.7265 0.0035 0.3272 4.1635 2.7957 6.4609 10.9293 5.3501 12.8414 1.7569 13.3532 2.5496 1.3655 1.0289 1.8717 0.4653 0.5025 0.3436 26.6204 57.0527 28.0758 47.7259 37.7705 0.0435 4.0518 0.3946 12.6065 23.1354 159.2617 6.0041 166.4798 44.4901 6.8785 15.4094 25.9304 12.5579 2.9367 115.4869 0.7374 518.4026 292.9522 3.7595 393.6252 114.7014 329.2104 374.9191 537.0636 9.4006 0.6185 402.9480 24.6037 81.0796 40.3404
temp: 298.150 k
press: 1.00000 atm
elementType: 9 9 9 9 9 9 9 9 9 9 9 9 9 9 9 9 9 9 7 7 6 6 6 6 6 6 6 6 6
symmnumber: 1
zpe: 276015.7 jmol-1
zpe.correction: 0.105129 hartree
zpe.thermalcorrener: 0.133601 hartree
zpe.thermalcorrenthalpy: 0.134546 hartree
zpe.thermalcorrgfe: 0.043951 hartree
zpe.sumelectzpe: -2247.310592 hartree
zpe.sumelectthermal: -2247.282120 hartree
zpe.sumelectthermalent: -2247.281176 hartree
zpe.sumelectthermalfe: -2247.371770 hartree
dipole: -0.0024 0.1441 -0.0065
dipole: 0.1442
quadrupole: -167.5550 -164.4791 -164.4788
quadrupole: -0.0020 -2.6363 0.0095
quadrupole: -2.0507 1.0252 1.0255 -0.0020 -2.6363 0.0095
hfenergy: -2247.4157213 hartree
pointgroup: C01 [X(C9F18N2)]
dipole: -0.0028604 0.0563099 0.0063681 debye
polarizability: 143.3412503|1.0058102|128.5677586|-0.505777|1.5704649|104.4607658 unknown
InChI: InChI=1S/C9F18N2/c10-3(11,12)1(4(13,14)15)28-7(8(22,23)24,9(25,26)27)29-2(5(16,17)18)6(19,20)21
charge 0 multiplicity 1
29 atoms
F  -1.779356 2.644645 1.191699
F  0.38857 2.968874 1.750241
F  -0.696028 1.098057 2.437491
F  1.415935 2.975916 -0.823722
F  -0.782023 3.098859 -1.344739
F  0.516847 1.482192 -2.265954
F  3.144941 -1.668783 1.60191
F  3.669499 0.531668 1.486595
F  4.311928 -0.859075 -0.179597
F  2.183851 -2.548707 -0.97613
F  2.424472 -0.765221 -2.36145
F  0.371328 -1.347601 -1.591837
F  -4.157638 -1.447218 0.017619
F  -3.725659 0.244161 -1.423135
F  -2.905734 -1.824304 -1.847851
F  -2.295498 -1.390424 2.214878
F  -0.183505 -1.577034 1.410037
F  -1.813295 -2.921058 0.606852
N  1.193268 0.592447 0.474852
N  -1.266153 0.489673 -0.397122
C  -0.079476 1.204635 0.081866
C  -0.545875 2.010006 1.376731
C  0.267944 2.22295 -1.095688
C  1.94151 -0.319362 -0.016993
C  -1.884008 -0.570035 -0.038964
C  3.277418 -0.567506 0.732305
C  1.732252 -1.249228 -1.242656
C  -3.180338 -0.888572 -0.830312
C  -1.544877 -1.619854 1.053375
