program: Gaussian 09
title: 000288951
version: EM64L-G09RevD.01
frameworkgroup: C1[X(C17H16O2)]
method: RPBEPBE
basis: SDD
operation: Freq
keyword: #pfreq=noraman
keyword: PBEPBE/SDD
title: #p freq=noraman PBEPBE/SDD
converged: YES YES NO NO
title: Mulliken charges:
elementType: O O C C C C C C C C C C C C C C C C C H H H H H H H H H H H H H H H H
charge: -0.258412 -0.237802 0.222126 0.453078 -0.365855 0.010740 0.292072 -0.344551 -0.406397 -0.844374 0.321288 -0.375075 -0.376169 -0.375767 -0.373795 -0.235806 -0.232588 -0.233593 -0.536374 0.246626 0.257181 0.232814 0.221254 0.233102 0.286019 0.253071 0.243620 0.265543 0.268787 0.229576 0.230608 0.230753 0.225118 0.223964 0.249215
chargesum: 0.00000
title: Mulliken charges with hydrogens summed into heavy atoms:
elementType: O O C C C C C C C C C C C C C C C C C
charge: -0.258412 -0.237802 0.222126 0.453078 -0.119229 0.010740 0.292072 -0.087370 -0.173583 -0.103997 0.321288 -0.122005 -0.132549 -0.110224 -0.105008 -0.006230 -0.001980 -0.002839 0.161923
polarizability: 3.44574500e+02 -1.42210288e+01 1.96933571e+02 1.68575757e+01 2.59828664e+00 1.17415111e+02
1716.lowfreq: -13.7493 -3.7762 -0.0005 -0.0001 0.0007 4.2824 22.6514 37.5168 47.4567
frequency: 22.6201 37.5111 47.4429 66.7374 79.0837 109.2755 123.1115 152.3181 197.1785 208.3446 217.8078 237.5830 248.1432 307.9055 334.9550 357.9376 367.6300 405.8023 407.5114 418.8660 448.4868 470.6672 523.4637 538.7041 571.4154 613.4490 624.0208 654.5416 696.7572 708.9963 730.5750 739.3622 755.6441 794.6489 813.2580 827.7467 840.8935 862.0292 915.5716 927.5691 944.9082 957.8821 968.4960 983.9313 987.8135 989.1222 998.5945 1002.3207 1014.6874 1032.4832 1036.6962 1082.6652 1111.7903 1118.3905 1150.5557 1157.8902 1173.0982 1183.4403 1188.4951 1232.8342 1245.3758 1267.2703 1312.6785 1317.3330 1358.8743 1380.0220 1383.5733 1406.5151 1429.9612 1431.6091 1436.2446 1465.7951 1467.5348 1471.4511 1475.3632 1490.4758 1499.3100 1520.2087 1565.4629 1584.5854 1606.0520 1610.4689 1620.3637 2964.6132 2971.1638 3054.8965 3056.8214 3094.4323 3097.3399 3124.2366 3125.4307 3130.3021 3136.0800 3148.5601 3157.7311 3160.0619 3164.3964 3167.7418 3195.6664
redmass: 3.6568 4.7690 4.2606 3.7572 4.3022 3.6621 4.6812 4.4141 4.2568 2.0507 1.9307 1.4626 1.9611 3.6696 4.2355 5.3012 4.6700 4.4979 2.9909 2.9245 4.2763 3.5190 4.4035 2.2497 5.2377 6.4352 6.6969 5.4417 3.9265 1.6612 3.3938 4.3534 3.9484 2.3605 1.3520 3.3011 1.8613 1.2541 2.9286 1.5650 1.5484 1.4638 1.3558 8.4265 1.4118 5.4194 2.6737 1.3320 2.1251 1.7690 1.5071 1.5942 1.2595 1.4417 2.4297 1.3370 1.0563 1.2785 1.1221 2.1014 3.2839 3.9359 1.3783 1.3678 3.3531 6.3939 1.3557 1.8752 3.0278 2.5305 1.1713 1.0847 1.0499 1.0770 2.1812 1.0818 2.4682 7.6320 6.6512 6.0890 6.0038 6.4327 6.3079 1.0327 1.0395 1.1042 1.0940 1.0985 1.0876 1.0892 1.0849 1.0997 1.0883 1.0926 1.0960 1.0899 1.0938 1.1010 1.0939
irintensity: 0.4820 0.1164 0.2586 4.1500 0.1974 5.8260 2.3998 1.0860 0.8950 1.5889 2.6748 4.4570 0.6178 1.2259 9.4732 2.0115 0.5325 8.3055 0.3760 0.4322 0.2379 0.2900 19.3378 26.0139 28.0699 0.3376 4.5496 13.3864 2.5062 96.4261 7.4628 15.3310 0.7230 17.4838 13.5350 11.0933 47.9035 3.6533 39.6610 7.0480 4.3923 7.2052 0.7280 74.4355 2.3507 0.5734 31.7595 1.1405 57.8927 12.0807 14.9668 9.7860 0.1842 14.4019 17.3305 6.8294 0.3492 216.0367 4.1336 5.4287 450.0828 131.2112 45.2211 17.7521 56.4418 4.9192 27.6620 18.2243 11.2870 26.2641 16.0086 24.3075 14.5467 56.2457 2.2928 28.4058 70.8086 330.9388 27.8020 10.1212 46.5251 154.3759 61.8404 83.4951 24.0558 43.8231 18.7298 3.4402 10.1653 15.8774 0.1463 20.6824 7.5362 20.9209 20.1583 4.1008 17.7546 21.8703 5.9186
temp: 298.150 k
press: 1.00000 atm
elementType: 8 8 6 6 6 6 6 6 6 6 6 6 6 6 6 6 6 6 6 1 1 1 1 1 1 1 1 1 1 1 1 1 1 1 1
symmnumber: 1
zpe: 734612.8 jmol-1
zpe.correction: 0.279799 hartree
zpe.thermalcorrener: 0.297119 hartree
zpe.thermalcorrenthalpy: 0.298063 hartree
zpe.thermalcorrgfe: 0.233064 hartree
zpe.sumelectzpe: -806.486905 hartree
zpe.sumelectthermal: -806.469585 hartree
zpe.sumelectthermalent: -806.468641 hartree
zpe.sumelectthermalfe: -806.533640 hartree
dipole: 3.8134 -4.6381 0.1199
dipole: 6.0057
quadrupole: -100.5747 -106.9806 -110.9417
quadrupole: 4.3236 -3.2754 4.7817
quadrupole: 5.5910 -0.8150 -4.7760 4.3236 -3.2754 4.7817
hfenergy: -806.7667039 hartree
pointgroup: C01 [X(C17H16O2)]
dipole: 1.4526774 1.5430214 -1.0448784 debye
polarizability: 340.2576545|-0.9341492|179.9830897|-37.4242373|-32.2658027|138.6824377 unknown
InChI: InChI=1S/C17H16O2/c1-13(17(18)15-6-4-3-5-7-15)12-14-8-10-16(19-2)11-9-14/h3-12H,1-2H3
charge 0 multiplicity 1
35 atoms
O  5.632698 0.083196 -0.733185
O  -2.883483 -1.806162 1.853852
C  -0.777372 -1.358594 0.772105
C  1.463769 -0.270687 0.057555
C  0.020357 -0.325714 0.314609
C  -2.237288 -1.101717 1.007613
C  -2.974189 -0.019241 0.255688
C  2.329012 -1.404022 -0.07668
C  2.053482 1.017783 -0.109211
C  -0.285037 -2.723897 1.211544
C  4.258215 0.047857 -0.47838
C  3.697021 -1.248678 -0.342046
C  3.426641 1.191709 -0.364541
C  -2.707778 0.290062 -1.105617
C  -4.045988 0.64053 0.915491
C  -3.487464 1.252284 -1.785426
C  -4.810712 1.614381 0.242491
C  -4.532987 1.924252 -1.111355
C  6.266559 1.397737 -0.881684
H  -0.485108 0.637363 0.155292
H  1.924897 -2.41493 -0.001035
H  1.413971 1.905336 -0.026513
H  -0.116636 -3.394764 0.346184
H  0.658388 -2.659396 1.78158
H  -1.053547 -3.187867 1.851544
H  4.355902 -2.115168 -0.453382
H  3.83218 2.201613 -0.475833
H  -1.914669 -0.244141 -1.639119
H  -4.265867 0.36625 1.952535
H  -3.283849 1.471747 -2.839466
H  -5.625843 2.126755 0.765459
H  -5.133625 2.674592 -1.63791
H  6.158434 2.000504 0.040404
H  5.843949 1.951494 -1.742067
H  7.329465 1.183334 -1.063598
