program: Gaussian 09
title: 000289163
version: EM64L-G09RevD.01
frameworkgroup: C1[X(C20H17FINO4S2)]
method: RPBEPBE
basis: SDD
operation: Freq
keyword: #p
keyword: freq=noraman
keyword: PBEPBE/SDD
title: #p freq=noraman PBEPBE/SDD
converged: YES YES NO NO
title: Mulliken charges:
elementType: I S S F O O O O N C C C C C C C C C C C C C C C C C C C C H H H H H H H H H H H H H H H H H
charge: 0.143778 0.914539 0.934464 -0.169168 -0.494520 -0.508395 -0.502653 -0.529637 -0.474500 0.099146 -0.060260 -0.024850 -0.235412 -0.245609 -0.194396 -0.236587 0.283583 -0.153175 0.451068 0.453952 -0.370663 -0.391870 -0.377869 -0.330675 -0.266694 -0.168305 -0.337978 -0.799485 -0.798680 0.286798 0.287630 0.304788 0.279188 0.295954 0.244917 0.246404 0.247103 0.243474 0.282312 0.258416 0.231703 0.245014 0.228982 0.239981 0.230132 0.238057
chargesum: 0.00000
title: Mulliken charges with hydrogens summed into heavy atoms:
elementType: I S S F O O O O N C C C C C C C C C C C C C C C C C C C C
charge: 0.143778 0.914539 0.934464 -0.169168 -0.494520 -0.508395 -0.502653 -0.529637 -0.474500 0.099146 -0.060260 -0.024850 0.051386 0.042020 0.110392 0.042601 0.283583 0.142779 0.451068 0.453952 -0.125746 -0.145466 -0.130766 -0.087201 0.015618 0.090112 -0.337978 -0.093786 -0.090510
polarizability: 5.09513638e+02 -1.16720831e+01 3.03632301e+02 -1.05212044e+01 -1.62001794e+01 2.56909769e+02
1716.lowfreq: -25.9748 -15.5934 -9.3362 -5.0482 -0.0011 -0.0009 -0.0006 2.3591 4.6899
frequency: -25.7939 -15.4246 -5.6362 9.4978 16.8407 21.5610 30.9145 35.5685 44.6384 61.3010 77.1918 86.2838 109.6680 113.0987 126.8657 127.9146 140.4083 148.7570 154.8590 179.1245 185.3410 189.8274 222.9934 226.6579 262.0974 265.4574 289.3855 291.4236 292.9339 306.9447 359.1403 371.3355 377.5118 379.6215 402.4800 406.1528 409.1727 418.9695 427.6430 445.5497 488.5147 499.6598 508.5294 511.2841 557.7926 583.1061 585.6644 590.5133 612.2917 619.2120 620.1546 703.4538 704.0926 731.7176 771.4834 775.5435 776.7472 802.5379 813.9416 823.7230 826.3744 827.2530 840.5855 845.6692 847.2847 861.7673 936.9833 943.6928 959.8158 961.7248 963.1711 978.9219 982.2727 984.8909 988.7566 990.6061 995.6558 1048.4854 1048.8163 1049.2434 1049.5474 1057.6902 1103.8002 1120.6228 1124.1444 1185.8210 1188.3015 1190.2740 1199.6993 1218.8524 1219.0723 1249.7908 1298.1639 1301.7797 1352.5627 1380.8811 1381.7640 1390.3258 1391.8584 1392.2886 1398.4416 1398.8634 1445.0965 1468.5965 1470.4818 1471.3771 1471.7782 1473.6020 1474.0185 1542.8354 1575.2016 1590.9149 1591.8085 1592.7620 1595.5629 2980.6283 2982.9379 3062.3442 3063.1284 3092.4676 3093.5589 3136.6728 3138.6576 3141.1753 3141.7217 3164.0428 3167.1602 3167.9737 3168.6292 3182.6684 3183.2765 3186.4470
redmass: 1.0286 1.0272 5.7416 6.9631 6.1339 5.7198 5.1371 5.4033 6.6701 5.0348 12.0110 8.6535 5.2510 7.9270 5.3576 7.2270 7.5735 14.0025 9.5992 12.3152 11.3783 6.9439 7.8540 8.2647 7.8018 7.7915 5.2873 5.2498 4.9609 4.7810 9.4206 4.2748 5.6842 3.9858 7.1789 3.0233 3.0663 9.5183 7.7712 4.3878 6.6852 3.6632 3.9365 4.2768 7.8261 5.6937 5.8636 4.9090 8.4374 6.9507 6.9660 3.2710 3.2829 3.0784 6.7159 5.0343 5.1392 6.1859 7.7767 1.4520 1.5759 1.5111 1.2502 4.1555 1.4502 1.5126 13.1993 7.6434 1.3457 1.4694 1.3116 1.4038 1.4813 1.7477 5.2215 1.4479 2.8611 2.1038 1.7980 2.3407 1.6300 2.1083 3.1843 1.2926 1.2980 1.1595 1.6908 1.2182 3.0327 3.0347 3.1439 1.3969 1.2634 1.2553 6.4369 4.2170 6.9803 4.1220 3.0714 2.7772 1.2224 1.3305 2.4003 1.0458 1.1159 2.1560 2.0793 1.0774 1.1785 8.3800 7.0818 5.9845 6.3878 6.8237 6.3607 1.0389 1.0375 1.0974 1.0948 1.1001 1.0989 1.0895 1.0896 1.0891 1.0905 1.0958 1.0893 1.0966 1.0958 1.0954 1.0942 1.0965
irintensity: 0.3246 0.4841 1.2545 0.6918 0.9564 0.9262 0.2210 0.1147 0.2053 0.1610 1.3815 0.1258 0.0972 0.4256 0.8284 1.8387 5.5258 0.2961 1.6573 1.4564 0.6079 0.8817 11.8338 19.4981 11.4149 2.3458 22.2651 1.6407 1.9175 4.0234 15.3395 9.6306 24.2792 5.9218 50.9178 7.1625 10.6245 98.8444 27.6884 78.3638 7.7588 64.9675 55.6828 68.4574 9.9916 19.9301 23.3781 6.7170 23.0010 0.5338 0.3122 0.8603 0.8627 0.0465 18.5586 4.7433 1.5814 25.5569 81.4417 99.5715 6.9693 22.6851 0.4819 71.6950 21.5729 18.3921 63.2565 51.7635 1.3547 2.5447 0.3747 0.4809 1.3469 1.6994 3.9902 1.3461 6.7033 5.5328 58.2519 22.6250 16.0147 28.4194 21.3336 6.7791 9.5116 16.6564 11.3618 26.7271 53.6165 8.3383 7.6593 5.1834 2.4724 3.2075 3.6211 5.7599 2.3190 31.5836 9.2911 12.0040 16.4814 13.8920 46.9466 13.5315 16.8394 28.4865 20.4385 15.1427 16.3446 23.9441 274.5448 17.0790 12.1156 0.2346 6.7027 27.1001 23.6649 14.4352 16.8506 14.4659 16.1786 10.3935 12.7419 9.1425 12.0590 2.6706 2.7799 8.1687 5.6585 6.5924 1.2216 0.1705
temp: 298.150 k
press: 1.00000 atm
elementType: 53 16 16 9 8 8 8 8 7 6 6 6 6 6 6 6 6 6 6 6 6 6 6 6 6 6 6 6 6 1 1 1 1 1 1 1 1 1 1 1 1 1 1 1 1 1
symmnumber: 1
zpe: 839713.5 jmol-1
zpe.correction: 0.319830 hartree
zpe.thermalcorrener: 0.347780 hartree
zpe.thermalcorrenthalpy: 0.348724 hartree
zpe.thermalcorrgfe: 0.256583 hartree
zpe.sumelectzpe: -2033.024035 hartree
zpe.sumelectthermal: -2032.996085 hartree
zpe.sumelectthermalent: -2032.995140 hartree
zpe.sumelectthermalfe: -2033.087281 hartree
dipole: 2.4392 5.6092 -5.0905
dipole: 7.9578
quadrupole: -156.4557 -183.5334 -205.4578
quadrupole: -4.8548 -16.6170 -3.5276
quadrupole: 25.3599 -1.7178 -23.6422 -4.8548 -16.6170 -3.5276
hfenergy: -2033.3438647 hartree
pointgroup: C01 [X(C20H17F1I1N1O4S2)]
dipole: 1.0691271 -0.610167 2.8786641 debye
polarizability: 353.6124134|-79.9442868|335.775648|-57.5406329|91.430849|380.6676469 unknown
InChI: InChI=1S/C20H17FINO4S2/c1-14-3-8-17(9-4-14)28(24,25)23(20-12-7-16(22)13-19(20)21)29(26,27)18-10-5-15(2)6-11-18/h3-13H,1-2H3
charge 0 multiplicity 1
46 atoms
I  1.948286 -4.891899 -4.789023
S  -2.19591 0.065385 -1.303369
S  0.850179 1.221721 -0.685758
F  0.334081 -3.023232 0.100017
O  -2.217284 1.266404 -2.400843
O  -2.791704 -1.401559 -1.681382
O  1.60257 1.535487 -2.097667
O  -0.103078 2.317725 0.040473
N  -0.265173 -0.446598 -0.739772
C  0.237913 -1.379617 -1.69288
C  -2.989497 0.629741 0.301229
C  2.145395 0.612906 0.531563
C  -3.546457 -0.359058 1.128012
C  3.385442 0.202029 0.020428
C  -3.034706 2.004512 0.579099
C  1.827659 0.620277 1.900012
C  0.531195 -2.698646 -1.243764
C  0.44621 -1.099599 -3.077698
C  -4.280545 1.449126 2.638185
C  4.095625 -0.248874 2.34051
C  -4.193982 0.070318 2.306962
C  4.361652 -0.230141 0.946802
C  -3.694741 2.40159 1.761649
C  2.821424 0.185547 2.800522
C  1.014655 -3.704074 -2.095196
C  0.930192 -2.087847 -3.954249
C  1.212965 -3.381699 -3.455179
C  -5.011388 1.898492 3.889604
C  5.146249 -0.718276 3.329324
H  -3.490449 -1.416331 0.851628
H  3.585304 0.239761 -1.055314
H  -2.570676 2.729102 -0.094924
H  0.8478 0.964475 2.244799
H  0.220686 -0.099379 -3.458811
H  -4.639761 -0.676237 2.973945
H  5.341351 -0.554115 0.57865
H  -3.748318 3.468092 2.007376
H  2.605507 0.181139 3.87519
H  1.21474 -4.699919 -1.692697
H  1.078924 -1.853543 -5.010955
H  -4.574333 2.822664 4.305981
H  -6.074828 2.111105 3.665964
H  -4.990069 1.122763 4.674344
H  4.795811 -1.604742 3.890229
H  6.08866 -0.989266 2.824991
H  5.373223 0.06729 4.073693
