program: Gaussian 09
title: 000289059
version: EM64L-G09RevD.01
frameworkgroup: C1[X(C14H22N2O4)]
method: RPBEPBE
basis: SDD
operation: Freq
keyword: #p
keyword: freq=noraman
keyword: PBEPBE/SDD
title: #p freq=noraman PBEPBE/SDD
converged: YES YES NO NO
title: Mulliken charges:
elementType: O O O O N N C C C C C C C C C C C C C C H H H H H H H H H H H H H H H H H H H H H H
charge: -0.209184 -0.242959 -0.411971 -0.223130 -0.456752 -0.200163 0.237134 0.011219 -0.483000 -0.506771 0.005657 -0.446921 -0.102621 0.101382 -0.747978 0.180099 -0.735292 -0.735083 -0.434136 0.230648 0.210218 0.213333 0.232803 0.216338 0.209753 0.193008 0.207450 0.199079 0.252514 0.320249 0.214344 0.219591 0.218266 0.215040 0.204654 0.226353 0.216728 0.232190 0.214411 0.281128 0.284889 0.387481
chargesum: 0.00000
title: Mulliken charges with hydrogens summed into heavy atoms:
elementType: O O O O N N C C C C C C C C C C C C C C
charge: -0.209184 -0.242959 -0.024490 -0.223130 -0.136503 -0.200163 0.237134 0.221436 -0.036863 -0.080680 0.198664 -0.040392 0.149893 0.101382 -0.095777 0.180099 -0.089244 -0.071754 0.131881 0.230648
polarizability: 2.00783395e+02 -3.23182264e+00 1.60802765e+02 1.94635909e+00 -2.97219358e+00 1.52049582e+02
1716.lowfreq: -15.2101 -0.0002 0.0004 0.0005 2.0669 5.8200 25.5727 43.0588 51.1659
frequency: 25.4055 43.0343 51.1390 58.5418 75.1558 85.4274 98.1362 115.0632 139.9648 162.9927 202.6198 212.9563 218.6946 234.0034 239.2699 253.9349 274.5179 283.3006 300.3136 302.6179 312.4504 329.2303 363.8572 406.4167 430.6815 456.6171 473.2888 485.9519 493.9003 534.3595 557.6650 596.6105 603.9936 614.1129 646.1142 684.1716 698.6087 725.3251 743.5727 787.8403 812.7356 817.5027 851.7583 878.7125 900.6534 912.2819 917.6926 943.7909 954.2690 960.7145 985.4045 986.6283 1024.0516 1047.8074 1067.1707 1071.6130 1076.0275 1085.6015 1106.1116 1136.5788 1142.4121 1149.9173 1162.3610 1187.3063 1195.4569 1224.3627 1243.7170 1260.3639 1284.3988 1293.1885 1297.7232 1307.6707 1312.1768 1318.7771 1330.7991 1337.6995 1343.6844 1347.4861 1352.4656 1359.6391 1367.2004 1378.1944 1389.2279 1391.5044 1398.2973 1425.6294 1452.0300 1464.7994 1467.1285 1471.2312 1474.8500 1477.2601 1479.4677 1484.9520 1492.9137 1647.7179 1670.9092 1713.8701 2933.3902 2961.2170 2965.6611 2969.3562 2971.3852 2972.9665 2980.3723 2981.1775 2986.6228 3013.5826 3027.5821 3035.7433 3043.0556 3060.5987 3066.7149 3068.9616 3071.1435 3071.7651 3082.7214 3088.4678 3518.3279 3611.8926
redmass: 5.5009 5.3752 8.5329 2.9118 6.3452 2.8513 3.8270 5.5306 6.1900 3.7460 1.0993 2.1521 1.2011 2.4536 1.5535 1.6282 3.5153 3.1500 3.9380 2.7720 11.0105 3.4421 3.2346 2.3223 1.8071 3.7723 1.2829 2.1582 2.8226 2.9696 3.6297 3.8003 3.7017 6.4926 1.6025 3.8693 8.1145 5.6984 4.7161 3.1473 2.1312 5.0858 1.7177 2.5222 2.2591 1.2184 1.9599 1.5994 1.6888 1.9207 1.7939 2.1407 1.6345 2.9899 2.3263 2.2205 1.8194 2.0571 2.7143 2.5777 2.4335 2.1912 3.0198 2.0730 2.0466 2.0894 1.5141 1.4831 1.3116 1.2824 1.6521 1.4196 1.4808 1.6459 1.4155 1.6115 1.5627 1.4507 1.5199 1.6227 1.4303 1.2109 1.2405 3.7538 1.2337 1.1343 1.0857 1.0750 1.0831 1.0491 1.0466 1.0575 1.0659 1.0531 1.0487 11.8453 9.3320 9.9803 1.0819 1.0743 1.0610 1.0358 1.0387 1.0681 1.0578 1.0422 1.0806 1.0608 1.0969 1.1015 1.1027 1.0990 1.0992 1.0983 1.0998 1.0994 1.1000 1.0983 1.0641 1.0796
irintensity: 0.0612 0.1042 1.5716 0.3743 0.6111 0.0649 0.0484 0.0303 5.2319 0.9826 0.0544 1.2927 0.3758 5.0442 0.3627 0.3309 0.7457 1.6948 1.5994 0.2220 8.8817 6.7121 0.6488 2.3692 1.0902 18.3736 101.2008 55.8438 0.8748 2.5384 41.6901 9.6775 6.1783 24.6768 116.8495 1.7374 7.4266 9.3270 28.2520 6.6184 2.1978 19.6765 12.5889 0.4937 10.2127 0.6399 5.5295 21.7034 3.5701 5.1552 5.8312 11.9321 6.1801 10.1291 2.8477 44.0132 70.4263 64.7059 25.0754 18.5838 2.8825 3.3467 10.0686 7.4761 1.2164 41.3102 22.3802 19.5199 2.8521 1.0843 18.5215 10.2309 21.5796 30.0823 1.5979 11.3640 20.6984 9.3752 22.1832 7.2503 0.3438 20.3209 20.3905 189.9618 14.7068 52.0620 6.9323 5.9944 4.8064 0.6557 19.8429 11.7123 7.1300 6.4375 12.5267 455.8134 333.3818 287.1683 20.6598 2.2337 29.9357 31.2951 50.5988 14.4052 51.4403 13.3037 10.9686 16.1833 47.5027 29.7497 26.4041 8.3627 52.1478 65.4466 35.3234 41.9809 3.0664 36.6607 32.1688 37.0402
temp: 298.150 k
press: 1.00000 atm
elementType: 8 8 8 8 7 7 6 6 6 6 6 6 6 6 6 6 6 6 6 6 1 1 1 1 1 1 1 1 1 1 1 1 1 1 1 1 1 1 1 1 1 1
symmnumber: 1
zpe: 917777.8 jmol-1
zpe.correction: 0.349563 hartree
zpe.thermalcorrener: 0.370321 hartree
zpe.thermalcorrenthalpy: 0.371265 hartree
zpe.thermalcorrgfe: 0.300027 hartree
zpe.sumelectzpe: -955.593297 hartree
zpe.sumelectthermal: -955.572539 hartree
zpe.sumelectthermalent: -955.571595 hartree
zpe.sumelectthermalfe: -955.642833 hartree
dipole: -4.5153 1.5552 0.5989
dipole: 4.8130
quadrupole: -124.4857 -114.0609 -135.1645
quadrupole: 7.8803 -0.2968 2.0667
quadrupole: 0.0847 10.5094 -10.5941 7.8803 -0.2968 2.0667
hfenergy: -955.9428601 hartree
pointgroup: C01 [X(C14H22N2O4)]
dipole: 1.7908877 0.5226708 -0.3243705 debye
polarizability: 201.0899167|1.4189379|160.6300434|-0.2279518|2.739455|151.9157813 unknown
InChI: InChI=1S/C14H22N2O4/c1-8(2)10-5-4-9(3)6-14(10)12(19)16(7-11(17)18)13(20)15-14/h8-10,15,17H,4-7H2,1-3H3
charge 0 multiplicity 1
42 atoms
O  -0.646998 -0.44754 2.096184
O  -1.638132 -1.386375 -2.406424
O  -3.11082 1.151471 0.28263
O  -4.809989 -0.129554 1.218353
N  0.367983 -0.694344 -1.314724
N  -1.468079 -0.989439 -0.054605
C  0.826546 -0.394159 0.062973
C  1.378085 1.062109 0.258785
C  1.874247 -1.438353 0.559576
C  2.759136 1.21004 -0.428544
C  3.257787 -1.279461 -0.115259
C  3.777459 0.165711 0.080441
C  0.365558 2.203657 -0.101567
C  -0.486094 -0.592887 0.858884
C  4.251849 -2.327701 0.428568
C  -0.962181 -1.05366 -1.401988
C  0.653133 3.451442 0.771904
C  0.342011 2.60093 -1.599589
C  -2.854103 -1.272672 0.27192
C  -3.698332 -0.05818 0.658328
H  1.544376 1.128188 1.355848
H  1.477315 -2.457239 0.384322
H  1.980214 -1.310753 1.655202
H  3.145119 2.231525 -0.249204
H  2.651152 1.111355 -1.528341
H  3.140244 -1.455848 -1.208302
H  4.745535 0.289801 -0.443032
H  3.971785 0.333537 1.160536
H  -0.651053 1.84896 0.16272
H  0.971207 -0.698262 -2.133853
H  4.396059 -2.201443 1.518731
H  3.890593 -3.358007 0.253215
H  5.240382 -2.226873 -0.056502
H  -0.05733 4.266013 0.5378
H  1.673456 3.843111 0.595243
H  0.558612 3.21613 1.848123
H  1.30395 3.045309 -1.916723
H  0.12111 1.742598 -2.256992
H  -0.442756 3.360621 -1.772263
H  -2.920699 -1.989567 1.107964
H  -3.313266 -1.735535 -0.622404
H  -3.70827 1.901346 0.550964
