program: Gaussian 09
title: 000289095
version: EM64L-G09RevD.01
frameworkgroup: C1[X(C21H14Cl2N2O4S)]
method: RPBEPBE
basis: SDD
operation: Freq
keyword: #p
keyword: freq=noraman
keyword: PBEPBE/SDD
title: #p freq=noraman PBEPBE/SDD
converged: YES YES NO NO
title: Mulliken charges:
elementType: Cl Cl S O O O O N N C C C C C C C C C C C C C C C C C C C C C H H H H H H H H H H H H H H
charge: 0.020262 0.028062 0.999990 -0.262022 -0.515547 -0.515964 -0.148698 -0.756395 -0.207991 0.355486 0.112012 -0.029763 0.182086 -0.352255 -0.296187 -0.241793 -0.237433 0.397528 0.247126 0.451564 -0.360754 -0.372895 -0.218213 -0.261440 0.134262 -0.380988 -0.308299 -0.797760 -0.210741 -0.235877 0.454321 0.279098 0.279704 0.283085 0.277252 0.245379 0.245560 0.233520 0.237249 0.244363 0.231881 0.231685 0.268592 0.270952
chargesum: 0.00000
title: Mulliken charges with hydrogens summed into heavy atoms:
elementType: Cl Cl S O O O O N N C C C C C C C C C C C C C C C C C C C C C
charge: 0.020262 0.028062 0.999990 -0.262022 -0.515547 -0.515964 -0.148698 -0.302074 -0.207991 0.355486 0.112012 -0.029763 0.182086 -0.073157 -0.016483 0.041292 0.039819 0.397528 0.247126 0.451564 -0.115375 -0.127336 0.015307 -0.024191 0.134262 -0.380988 -0.308299 -0.089832 0.057851 0.035075
polarizability: 4.44916980e+02 4.82869108e+01 3.57241683e+02 -2.01842430e+01 1.83907532e+01 2.10932370e+02
1716.lowfreq: -20.0452 -9.6535 -4.9360 -1.7820 0.0017 0.0020 0.0021 5.5231 13.5501
frequency: -17.5031 -5.2819 13.5043 27.3865 31.7068 36.2279 67.0584 79.3593 84.8611 90.6502 120.0470 128.2218 131.7119 141.7458 170.0912 175.1892 186.0134 217.8048 224.4414 229.3505 253.4507 273.6078 282.2536 295.3016 307.4810 312.9533 323.3026 357.4897 373.1359 381.6759 406.6163 413.0147 435.3994 442.4498 447.1834 482.0535 489.7745 506.0395 523.6721 565.2039 579.6031 583.5521 588.4153 597.6966 620.0331 635.1801 656.1257 670.6334 685.7504 689.5214 707.3005 754.8907 773.3171 776.4645 779.1806 785.6007 808.9007 817.9905 819.3212 825.2414 844.9224 860.3425 871.6280 884.3490 907.0060 923.5432 948.0600 952.9366 959.7069 973.8734 980.3595 989.8599 992.8580 995.8453 1020.1420 1045.4154 1048.5783 1049.8465 1118.2341 1121.2151 1128.6842 1133.3911 1177.2348 1186.1147 1198.9089 1217.8282 1221.0451 1240.9936 1297.6520 1303.3529 1317.9008 1343.8859 1348.3186 1379.6974 1380.3939 1390.0258 1393.0181 1399.7087 1430.5784 1449.7799 1470.6230 1472.5085 1474.0383 1482.2524 1528.7853 1550.1039 1566.1016 1586.0478 1593.2616 1595.1703 1620.3655 1703.2615 2950.8631 2981.1534 3063.8279 3093.3392 3137.3055 3137.5514 3139.1814 3159.2881 3160.9995 3166.9401 3168.6551 3171.4581 3181.6142 3187.2082
redmass: 1.3900 2.3290 7.6127 4.2104 12.5992 6.3709 12.3865 6.8908 5.1881 10.2144 11.1808 6.5408 5.4686 8.5952 8.8350 12.4237 7.2785 10.8263 9.9342 9.9907 6.9507 8.9276 7.3395 5.9308 4.9339 21.7296 5.5031 9.0550 5.6033 4.7475 2.8659 10.6323 3.9053 7.6927 6.7474 4.7383 10.2640 3.1510 3.5106 9.5247 6.1193 7.6574 5.1570 9.5732 6.9440 8.4702 6.0736 6.2874 7.9782 7.5380 3.3059 2.8756 2.2218 2.5216 7.7491 9.7016 7.9589 1.3372 4.1899 1.5820 1.2474 2.8762 1.6644 1.3784 10.3279 9.1897 1.3558 10.9848 1.3118 1.3618 1.3857 1.5024 4.7227 1.3438 8.2581 2.1886 2.2340 1.7000 2.0001 1.3021 2.2756 3.1535 1.1295 1.1356 2.0307 3.0761 2.0862 1.6201 1.2641 3.1478 2.1167 2.2562 6.1617 5.8852 5.9632 3.0379 4.2168 1.2198 2.7835 3.2331 1.1362 2.1401 1.0674 2.5220 6.7888 7.0791 6.8314 8.2400 5.9372 6.8930 6.1863 12.9210 1.0869 1.0391 1.0947 1.1001 1.0887 1.0877 1.0894 1.0898 1.0963 1.0961 1.0894 1.0946 1.0992 1.0973
irintensity: 0.0511 1.1074 0.8048 0.4940 0.2729 1.8781 0.2399 0.0509 0.5550 1.0725 1.2905 1.3675 1.4317 0.4657 1.2672 0.6070 3.0532 2.6123 2.3782 6.6335 3.0387 0.3464 1.1002 8.7524 5.9679 2.8146 0.4904 9.4210 14.9632 1.8979 0.1042 31.0664 8.8150 135.1279 21.2826 21.5512 2.9482 98.1592 1.2022 73.1443 8.0793 56.3552 3.9825 3.7613 0.9730 38.7318 39.9377 5.7896 0.1298 4.0069 4.5927 29.3485 40.1170 43.4032 0.2150 45.1472 114.6528 39.1863 42.3134 21.8943 2.7441 128.7614 126.4589 17.0996 24.8703 49.2288 0.0759 67.4574 2.3622 2.7403 0.7835 4.0193 3.2026 1.9286 92.7289 39.6506 27.0052 9.5998 9.0766 7.4758 20.9338 16.4844 10.0518 18.7957 105.8654 6.4907 50.5511 40.7298 3.3057 393.4745 65.6311 14.9790 34.2798 54.5231 72.3222 10.8527 12.1179 16.7416 5.1195 422.9943 14.6208 29.0436 11.9323 75.9942 595.1265 236.3571 31.6834 48.0771 9.9984 0.0523 126.9433 357.6328 705.7315 21.7248 19.8672 13.2427 5.2867 11.4883 8.8187 7.8310 3.5917 6.2449 0.6731 2.9961 19.0683 0.1695
temp: 298.150 k
press: 1.00000 atm
elementType: 17 17 16 8 8 8 8 7 7 6 6 6 6 6 6 6 6 6 6 6 6 6 6 6 6 6 6 6 6 6 1 1 1 1 1 1 1 1 1 1 1 1 1 1
symmnumber: 1
zpe: 789244.0 jmol-1
zpe.correction: 0.300607 hartree
zpe.thermalcorrener: 0.326089 hartree
zpe.thermalcorrenthalpy: 0.327034 hartree
zpe.thermalcorrgfe: 0.243313 hartree
zpe.sumelectzpe: -2534.971216 hartree
zpe.sumelectthermal: -2534.945734 hartree
zpe.sumelectthermalent: -2534.944790 hartree
zpe.sumelectthermalfe: -2535.028510 hartree
dipole: 2.4341 -2.7016 5.1020
dipole: 6.2653
quadrupole: -186.1509 -176.2925 -205.3628
quadrupole: 19.1200 33.4178 -8.3008
quadrupole: 3.1178 12.9762 -16.0941 19.1200 33.4178 -8.3008
hfenergy: -2535.2718233 hartree
pointgroup: C01 [X(C21H14Cl2N2O4S1)]
dipole: -0.0602661 2.4604245 -0.1365273 debye
polarizability: 462.5719465|-31.6907119|224.9788171|-8.1972009|-41.9044796|325.5402701 unknown
InChI: InChI=1S/C21H14Cl2N2O4S/c1-12-6-8-13(9-7-12)30(27,28)25-17-5-3-2-4-14(17)20-24-19-16(23)11-10-15(22)18(19)21(26)29-20/h2-11,25H,1H3
charge 0 multiplicity 1
44 atoms
Cl 1.959357 -0.801046 -2.513436
Cl 6.398201 -1.316147 2.105527
S  -2.190481 -0.627533 -1.817181
O  1.762367 -1.343268 2.746612
O  -1.225808 -0.957256 -3.075389
O  -3.644948 -1.333741 -1.647462
O  3.861931 -1.453294 3.653142
N  -1.129397 -0.984727 -0.366183
N  1.352844 -1.116749 0.402678
C  -1.534708 -1.140837 0.95323
C  -0.51527 -1.262926 1.981882
C  -2.443224 1.242823 -1.724629
C  0.897731 -1.236149 1.646823
C  -2.905807 -1.187256 1.352193
C  -0.909196 -1.410777 3.346915
C  -1.413432 2.066709 -2.207144
C  -3.65287 1.730125 -1.208277
C  2.722882 -1.090503 0.153256
C  3.701872 -1.205145 1.212564
C  -2.810951 4.014041 -1.616409
C  -1.61278 3.462636 -2.146602
C  -3.824997 3.131524 -1.159297
C  -3.251905 -1.326879 2.703879
C  -2.258377 -1.435799 3.714708
C  3.220655 -1.343054 2.60246
C  3.177737 -0.946486 -1.187962
C  5.083791 -1.178353 0.868961
C  -2.995424 5.517446 -1.529177
C  4.543065 -0.925371 -1.498148
C  5.502231 -1.042164 -0.466039
H  -0.087278 -1.02367 -0.550729
H  -3.683804 -1.160029 0.585227
H  -0.121718 -1.503287 4.09985
H  -0.502707 1.634013 -2.6339
H  -4.439239 1.040817 -0.885321
H  -0.829727 4.132115 -2.520314
H  -4.761876 3.54193 -0.766007
H  -4.312607 -1.365562 2.976575
H  -2.544261 -1.549142 4.764429
H  -2.596703 5.905979 -0.572046
H  -2.462117 6.040128 -2.341954
H  -4.060878 5.800504 -1.579532
H  4.866673 -0.819479 -2.5372
H  6.568949 -1.026963 -0.702474
