program: Gaussian 09
title: 000288949
version: EM64L-G09RevD.01
frameworkgroup: C1[X(C8H17NO)]
method: RPBEPBE
basis: SDD
operation: Freq
keyword: #p
keyword: freq=noraman
keyword: PBEPBE/SDD
title: #p freq=noraman PBEPBE/SDD
converged: YES YES NO NO
title: Mulliken charges:
elementType: O N C C C C C C C C H H H H H H H H H H H H H H H H H
charge: -0.444460 -0.119672 0.223554 -0.434446 -0.428695 0.297247 -0.760359 -0.703261 -0.711877 -0.711802 0.218540 0.210348 0.197378 0.213759 0.234897 0.243488 0.206000 0.209815 0.214629 0.213506 0.226339 0.218417 0.204811 0.220215 0.204787 0.226480 0.330361
chargesum: 0.00000
title: Mulliken charges with hydrogens summed into heavy atoms:
elementType: O N C C C C C C C C
charge: -0.114098 -0.119672 0.223554 -0.005558 -0.017558 0.297247 -0.075973 -0.065311 -0.062309 -0.060321
polarizability: 1.12183561e+02 -3.43171525e-01 8.69218803e+01 -1.90174591e+00 1.85689479e-01 9.01973410e+01
1716.lowfreq: -22.4240 -10.0037 -0.0008 -0.0005 -0.0003 10.8427 54.3483 60.1675 156.8061
frequency: 52.9193 59.9159 156.7800 164.2662 217.9233 229.6610 253.7826 255.2746 266.9872 286.3689 303.8272 328.7100 347.1366 383.5559 411.9902 428.6090 462.2834 500.6037 548.9654 682.3008 781.8279 861.2323 888.6871 896.5156 915.6172 922.7083 940.1705 947.0616 958.5169 1000.1282 1013.2137 1050.2127 1064.1812 1084.6892 1098.1161 1125.9505 1176.1138 1218.1306 1238.3444 1243.0132 1247.0660 1266.4938 1282.8256 1358.3702 1365.2145 1370.4499 1385.8581 1394.0014 1449.3798 1458.5829 1460.8544 1464.0442 1468.1969 1473.2472 1475.0900 1480.4155 1484.7072 1495.8803 2939.6197 2962.1142 2969.7196 2976.5294 2977.1952 2983.0311 3026.1351 3043.9250 3062.4392 3068.9355 3071.7404 3075.6590 3078.7801 3084.6858 3089.0868 3090.9232 3550.2576
redmass: 2.5681 2.9656 1.1605 2.4200 1.6200 1.3120 1.0891 1.2082 1.1663 2.1135 2.2123 2.4850 2.4305 2.2944 2.6763 2.4787 2.6209 2.7460 3.0390 3.9745 2.8279 2.8564 1.6981 1.6737 1.5503 2.4372 1.2274 1.8187 1.6213 1.8331 1.4204 2.0921 3.0531 1.1537 1.3607 1.4961 2.6841 2.5866 2.8251 2.1058 2.2837 2.0955 1.5065 2.0560 1.2637 1.2250 1.2563 1.2132 1.0578 1.0570 1.0621 1.0584 1.0476 1.0608 1.0565 1.0628 1.1004 1.0608 1.0601 1.0594 1.0389 1.0348 1.0350 1.0362 1.1019 1.1032 1.0967 1.0998 1.0991 1.0991 1.0984 1.1003 1.0999 1.0994 1.0656
irintensity: 0.2276 1.6897 0.1422 1.5147 2.2102 0.6403 33.9589 28.1248 32.6964 46.6941 5.6420 1.0014 12.3141 1.0605 2.7457 7.6502 5.9232 1.9470 0.9984 6.8468 2.9767 1.2195 0.7252 1.3575 0.5092 29.0345 0.1764 1.4802 6.8041 7.4216 1.9600 10.7467 11.6316 10.3916 50.3212 7.9399 51.1219 35.0482 75.5496 32.8388 27.8436 2.3076 18.3763 38.0851 25.9923 26.9168 31.0498 14.9558 1.5511 0.3193 0.1808 3.9737 0.0779 7.9760 14.2626 8.4637 2.5272 19.0504 69.2543 36.6982 31.2914 40.4456 30.9124 13.6457 48.2585 39.8829 33.4916 4.7858 5.0710 48.8735 88.7648 4.2920 24.1312 68.9024 2.2637
temp: 298.150 k
press: 1.00000 atm
elementType: 8 7 6 6 6 6 6 6 6 6 1 1 1 1 1 1 1 1 1 1 1 1 1 1 1 1 1
symmnumber: 1
zpe: 623240.9 jmol-1
zpe.correction: 0.237380 hartree
zpe.thermalcorrener: 0.249770 hartree
zpe.thermalcorrenthalpy: 0.250714 hartree
zpe.thermalcorrgfe: 0.200142 hartree
zpe.sumelectzpe: -444.146952 hartree
zpe.sumelectthermal: -444.134562 hartree
zpe.sumelectthermalent: -444.133618 hartree
zpe.sumelectthermalfe: -444.184190 hartree
dipole: 0.4765 -0.5202 -1.0205
dipole: 1.2406
quadrupole: -57.6295 -67.6896 -62.0082
quadrupole: -3.1030 -3.8732 -1.3985
quadrupole: 4.8129 -5.2472 0.4343 -3.1030 -3.8732 -1.3985
hfenergy: -444.384332 hartree
pointgroup: C01 [X(C8H17N1O1)]
dipole: 0.1583667 0.2457046 0.3908687 debye
polarizability: 111.8546453|2.2122953|87.15551|2.5298997|0.6206336|90.2926275 unknown
InChI: InChI=1S/C8H17NO/c1-7(2,3)9-5-8(4,10)6-9/h10H,5-6H2,1-4H3
charge 0 multiplicity 1
27 atoms
O  2.659626 -1.139984 0.20192
N  -0.286422 0.39075 -0.037669
C  1.829511 0.062143 0.092762
C  0.742712 -0.139931 -1.005857
C  0.64715 0.16975 1.125756
C  -1.686308 -0.135956 -0.025988
C  2.677389 1.328573 -0.045123
C  -1.772274 -1.676523 0.198981
C  -2.438344 0.597106 1.111397
C  -2.316421 0.225609 -1.393265
H  0.847556 0.445894 -1.93575
H  0.65144 -1.220297 -1.246719
H  0.514429 -0.798662 1.655274
H  0.673906 0.999608 1.855795
H  3.353003 1.250337 -0.916155
H  2.02375 2.207889 -0.183461
H  3.291751 1.50173 0.860978
H  -1.347273 -1.967782 1.177031
H  -2.827283 -2.00506 0.18018
H  -1.233529 -2.232031 -0.590337
H  -2.392216 1.689278 0.954791
H  -1.989302 0.369873 2.096397
H  -3.498263 0.285565 1.141949
H  -1.78694 -0.279556 -2.222554
H  -3.376384 -0.085613 -1.428397
H  -2.258754 1.315631 -1.560793
H  3.390789 -0.971837 0.849657
