program: Gaussian 09
title: 000288936
version: EM64L-G09RevD.01
frameworkgroup: C1[X(C11H13NO2)]
method: RPBEPBE
basis: SDD
operation: Freq
keyword: #p
keyword: freq=noraman
keyword: PBEPBE/SDD
title: #p freq=noraman PBEPBE/SDD
converged: YES YES NO NO
title: Mulliken charges:
elementType: O O N C C C C C C C C C C C H H H H H H H H H H H H H
charge: -0.414839 -0.226626 -0.103775 -0.154803 -0.502232 -0.373644 -0.520314 0.196456 0.446122 -0.438984 -0.368815 -0.218662 -0.233193 -0.245148 0.239880 0.244965 0.253450 0.233872 0.190251 0.191459 0.237982 0.229165 0.280824 0.377136 0.223419 0.229469 0.226583
chargesum: 0.00000
title: Mulliken charges with hydrogens summed into heavy atoms:
elementType: O O N C C C C C C C C C C C
charge: -0.037703 -0.226626 -0.103775 0.085077 -0.003817 0.050480 -0.090872 0.196456 0.446122 -0.209819 -0.087991 0.004756 -0.003723 -0.018565
polarizability: 1.47584312e+02 -1.90240425e+01 1.16575518e+02 -1.14623266e+01 -1.34405222e+01 1.06873029e+02
1716.lowfreq: -4.6662 -0.0009 -0.0008 -0.0004 7.6043 11.5420 26.2010 40.1810 44.7896
frequency: 25.5955 39.9696 44.6156 63.0878 139.2839 151.9305 194.7037 235.2339 299.1497 318.9124 341.1663 401.7164 406.8246 462.7440 582.2977 599.6657 604.4873 617.5637 667.4657 694.2010 706.8266 744.6190 786.3983 808.1207 831.1914 860.9361 912.4879 915.5794 949.0428 968.1259 983.7753 989.6906 997.1618 1003.5025 1025.4529 1046.0549 1054.7737 1079.3046 1086.2653 1125.1626 1170.4933 1176.3231 1182.6190 1188.7087 1213.6853 1219.3866 1233.1115 1251.7400 1261.3717 1286.4496 1315.5520 1353.2620 1373.6641 1387.8550 1440.8714 1457.5106 1459.2121 1482.6590 1487.3729 1594.1900 1614.7633 1668.6505 2852.5748 2925.3282 2964.2399 2982.8385 3049.2681 3058.1643 3112.3912 3124.7127 3137.0385 3137.8410 3151.1288 3162.9992 3507.5951
redmass: 6.1183 5.6878 4.1072 4.3923 3.2288 3.6795 3.8611 2.9728 3.7266 2.9363 3.8735 5.6403 2.8788 2.9796 4.8425 1.5934 4.1029 5.4722 2.5388 2.5069 2.1406 1.5679 3.2125 3.5699 1.5135 1.2503 2.8789 1.3993 2.7420 2.0134 1.4120 5.3170 3.1234 1.3871 2.1948 2.0076 2.9033 1.6053 1.8060 1.4312 1.0660 1.7598 1.1148 2.0897 1.5919 1.7550 1.4341 1.4486 1.3327 1.4327 1.3716 1.6026 1.8496 4.4660 2.1129 1.1020 1.1177 2.1720 1.1272 6.1567 6.0942 8.6363 1.0701 1.0679 1.0842 1.0867 1.0849 1.0704 1.0869 1.0867 1.1093 1.0920 1.0954 1.1009 1.0639
irintensity: 1.7339 0.7697 0.4317 0.7064 1.4100 1.0213 2.5502 3.7323 3.2470 2.5516 0.4147 11.2885 0.5207 11.8443 1.3605 79.9651 16.3370 5.5176 9.8946 107.0732 13.6678 73.1839 12.8539 3.3590 0.6923 0.5902 15.0167 1.8478 0.8173 27.2853 4.1849 0.5283 69.1932 2.7653 9.4258 79.1459 89.1518 9.9595 12.2490 10.0255 0.0742 16.4138 1.3731 9.5156 4.4024 13.8727 3.1004 15.8213 3.7185 10.7903 4.0187 14.9224 21.3895 3.7188 11.1183 10.0599 10.6877 11.8706 2.1686 0.8297 4.7805 158.8680 74.8438 103.5810 39.3451 21.7004 30.9922 43.7242 8.2466 1.7261 18.4087 27.3576 24.0520 21.4943 19.4755
temp: 298.150 k
press: 1.00000 atm
elementType: 8 8 7 6 6 6 6 6 6 6 6 6 6 6 1 1 1 1 1 1 1 1 1 1 1 1 1
symmnumber: 1
zpe: 572716.1 jmol-1
zpe.correction: 0.218136 hartree
zpe.thermalcorrener: 0.230914 hartree
zpe.thermalcorrenthalpy: 0.231858 hartree
zpe.thermalcorrgfe: 0.176814 hartree
zpe.sumelectzpe: -631.098419 hartree
zpe.sumelectthermal: -631.085641 hartree
zpe.sumelectthermalent: -631.084697 hartree
zpe.sumelectthermalfe: -631.139741 hartree
dipole: 0.5038 -1.2313 1.9377
dipole: 2.3504
quadrupole: -75.2981 -75.9611 -84.6195
quadrupole: -6.7728 1.3170 0.5962
quadrupole: 3.3282 2.6652 -5.9933 -6.7728 1.3170 0.5962
hfenergy: -631.3165552 hartree
pointgroup: C01 [X(C11H13N1O2)]
dipole: 0.3092528 -0.0030451 -0.8714833 debye
polarizability: 143.5107163|26.5802456|105.0031777|2.4304916|-6.480552|122.5189649 unknown
InChI: InChI=1S/C11H13NO2/c13-11(14)10-6-7-12(10)8-9-4-2-1-3-5-9/h1-5,10,13H,6-8H2
charge 0 multiplicity 1
27 atoms
O  1.219179 -2.410834 0.21612
O  1.492999 -1.06806 2.092983
N  1.291668 1.17761 -0.058924
C  1.985912 -0.156659 -0.157817
C  3.339002 0.57969 0.144297
C  2.600414 1.903737 -0.237175
C  0.171686 1.472859 -0.969583
C  1.54313 -1.202415 0.852515
C  -1.102787 0.719861 -0.599367
C  -1.99054 0.276988 -1.610823
C  -1.436522 0.487526 0.75924
C  -3.198124 -0.376548 -1.274498
C  -2.639974 -0.170427 1.096521
C  -3.527098 -0.602064 0.082136
H  1.955173 -0.596149 -1.177413
H  4.199019 0.286571 -0.47417
H  3.593279 0.532412 1.214093
H  2.732078 2.776612 0.424201
H  2.798256 2.201784 -1.2920
H  0.430062 1.262194 -2.038721
H  -0.007694 2.565649 -0.897004
H  -1.735587 0.440751 -2.665761
H  -0.738255 0.815788 1.536751
H  0.932416 -3.075131 0.90092
H  -3.875777 -0.714018 -2.067135
H  -2.884606 -0.346799 2.15025
H  -4.461012 -1.111827 0.345165
