program: Gaussian 09
title: 000288909
version: EM64L-G09RevD.01
frameworkgroup: C1[X(C10H7NO2)]
method: RPBEPBE
basis: SDD
operation: Freq
keyword: #p
keyword: freq=noraman
keyword: PBEPBE/SDD
title: #p freq=noraman PBEPBE/SDD
converged: NO NO NO NO
title: Mulliken charges:
elementType: O O N C C C C C C C C C C H H H H H H H
charge: -0.295226 -0.206634 -0.669698 0.080706 0.301295 0.341702 0.080820 -0.417648 -0.025399 -0.407246 -0.191954 -0.274221 -0.285805 0.287179 0.230085 0.236865 0.261174 0.261937 0.383783 0.308287
chargesum: 0.00000
title: Mulliken charges with hydrogens summed into heavy atoms:
elementType: O O N C C C C C C C C C C
charge: -0.295226 -0.206634 0.022371 0.080706 0.301295 0.341702 0.080820 -0.130469 -0.025399 -0.177160 0.044911 -0.013048 -0.023869
polarizability: 1.79689201e+02 -1.55313352e+00 1.57519287e+02 9.02154040e-03 2.29597606e-03 4.67680029e+01
1716.lowfreq: -0.0003 0.0007 0.0008 5.1454 8.0066 12.3641 86.8385 124.0546 183.6663
frequency: 86.8348 124.0482 183.6649 234.4347 282.4282 286.9971 372.2626 393.8114 440.3168 441.4733 459.4004 508.0437 510.9664 529.1099 594.3286 614.2506 631.8166 693.7050 743.3277 770.7179 778.8286 823.9272 831.6872 863.4604 922.8552 928.5926 993.5896 1001.7901 1030.7082 1049.2339 1090.1302 1125.8848 1173.0168 1195.1150 1288.7974 1312.3975 1339.5734 1374.6391 1419.0275 1430.6341 1456.4775 1502.1934 1536.2942 1571.3968 1586.8638 1610.9574 1632.4000 3127.7353 3143.0172 3151.6032 3168.7447 3170.5255 3292.0543 3627.5974
redmass: 6.5099 6.1334 5.0934 4.3631 6.2750 4.2692 5.3906 7.7901 8.5535 5.6651 3.4533 1.4396 6.9638 2.4587 4.1863 6.4272 2.5422 2.9216 7.0858 5.5001 1.9099 1.1249 3.1484 1.8686 1.4493 5.5082 1.3635 1.3192 3.8164 1.7741 2.0154 1.4621 1.2225 1.4711 2.0333 2.7246 2.4520 3.2415 5.4935 4.0861 3.1214 5.2817 6.6386 3.3252 2.7252 2.8855 7.0672 1.0878 1.0868 1.0924 1.0999 1.0976 1.0619 1.0901
irintensity: 5.7403 6.0323 0.3964 6.5434 0.2332 0.3553 8.0805 2.3956 15.0873 4.2694 6.5501 79.6050 0.8365 23.1846 1.3352 13.8506 10.4383 31.0686 4.7539 0.6092 104.1134 24.5138 94.7520 34.6065 0.0762 0.4075 1.3585 0.0003 11.1841 13.1692 7.9606 34.6457 43.9264 1.8481 28.3804 65.8765 82.9013 3.5031 28.3928 25.0447 30.6792 86.8451 277.7025 15.5486 67.4411 209.5913 16.7393 7.9941 0.5826 15.5717 19.9892 4.5251 53.7597 62.3124
temp: 298.150 k
press: 1.00000 atm
elementType: 8 8 7 6 6 6 6 6 6 6 6 6 6 1 1 1 1 1 1 1
symmnumber: 1
zpe: 385518.7 jmol-1
zpe.correction: 0.146836 hartree
zpe.thermalcorrener: 0.156630 hartree
zpe.thermalcorrenthalpy: 0.157574 hartree
zpe.thermalcorrgfe: 0.111818 hartree
zpe.sumelectzpe: -589.581279 hartree
zpe.sumelectthermal: -589.571485 hartree
zpe.sumelectthermalent: -589.570541 hartree
zpe.sumelectthermalfe: -589.616297 hartree
dipole: 3.7837 -0.3782 -0.0010
dipole: 3.8026
quadrupole: -65.0353 -75.6746 -77.5305
quadrupole: -11.6079 -0.0009 -0.0045
quadrupole: 7.7114 -2.9278 -4.7837 -11.6079 -0.0009 -0.0045
hfenergy: -589.7281156 hartree
pointgroup: C01 [X(C10H7N1O2)]
dipole: 1.4952015 0.0501804 -0.000388 debye
dipolederiv: -0.309894 -0.375974 -0.0000431 0.237842 -1.0453384 -0.0000146 0.0000845 -0.0002242 -0.3576419 -0.8576324 -0.0892258 -0.0000838 -0.5135768 -0.5973288 -0.0001109 0.0000397 0.0000002 -0.3250521 -0.7428433 -0.3948661 0.0001278 -0.7828877 -0.7065493 -0.0000546 0.0001795 -0.0000623 -0.621145 -0.524203 0.0323901 0.0000299 0.5700645 -0.6513067 -0.0000091 -0.0000472 -0.0000481 -0.078246 -0.6372616 0.2340327 -0.0000428 0.0488396 0.2661984 0.0000042 -0.0001331 0.0000711 0.0469118 0.467452 0.3837632 -0.0000865 0.9805727 0.6729624 -0.0000412 -0.0001319 -0.0000706 0.164965 0.705801 0.1316855 0.0000681 -0.5376166 1.0868203 0.0001013 -0.0000712 0.000215 0.1720496 -0.2026333 0.2860799 0.0000274 0.1411922 -0.210339 0.000001 -0.0000242 0.0000399 -0.1498533 1.0664054 -0.1680694 0.0000627 0.2965709 0.8210109 0.0000885 0.000051 0.0000357 0.1674066 0.1536488 0.0494422 0.0000308 -0.5026277 -0.1787281 -0.000008 0.0001091 0.0000345 -0.19883 0.4016854 -0.2749015 0.0000354 0.0397505 0.1247436 -0.0000236 0.0000564 -0.000053 -0.106644 -0.1112574 -0.1508972 -0.0000229 -0.1288841 0.1747468 0.0000393 0.0000461 0.0000106 -0.1070577 0.1439197 0.0865284 0.0000236 -0.0627431 -0.3167874 -0.0000142 0.0000116 -0.000006 -0.1156867 0.0596501 -0.0778387 -0.0000105 -0.0221436 0.043194 -0.0000021 -0.0000084 -0.0000036 0.1612242 -0.1165113 0.0212901 -0.000028 -0.0403619 0.080117 -0.0000015 -0.0000136 0.0000123 0.1631711 0.0512817 0.0820334 -0.0000159 0.0987221 -0.0675607 0.0000189 -0.0000252 0.0000198 0.1513051 0.0526361 0.0301112 0.0000021 0.0957204 -0.0306495 -0.0000186 0.0000127 -0.0000257 0.149842 -0.0645216 0.045098 -0.0000014 -0.0130005 0.0820325 -0.0000107 -0.0000141 -0.0000092 0.156883 0.2489836 0.1057143 -0.0000408 0.0076842 0.2456219 0.0000057 -0.0001056 0.0000198 0.3623843 0.2152943 0.0436036 -0.0000322 0.086883 0.2071399 0.0000499 -0.0000161 0.0000439 0.3640141 unknown
polarizability: 179.7071|1.4195357|157.501388|0.0086368|0.0034736|46.7680029 unknown
InChI: InChI=1S/C10H7NO2/c11-7-3-1-2-6-8(12)4-5-9(13)10(6)7/h1-5H,11H2
charge 0 multiplicity 1
20 atoms
O  0.421113 2.787989 0.000557
O  -2.642427 -1.783345 -0.000126
N  2.631595 1.35889 -0.000002
C  0.39686 0.357623 -0.000027
C  -0.403052 -0.83315 -0.00011
C  1.836508 0.237989 0.000102
C  -0.245471 1.677479 0.000027
C  0.19704 -2.106814 -0.000005
C  -1.899587 -0.745715 -0.000312
C  2.419844 -1.072954 0.000264
C  1.611852 -2.216952 0.000208
C  -1.726463 1.735639 0.000021
C  -2.50212 0.608773 -0.000128
H  -0.449657 -2.989247 -0.000071
H  3.512356 -1.167376 0.000397
H  2.080593 -3.206759 0.000309
H  -2.158679 2.742534 0.000177
H  -3.596703 0.652886 -0.000106
H  2.149192 2.2733 -0.000331
H  3.645808 1.275513 0.000156
