program: Gaussian 09
title: 000288916
version: EM64L-G09RevD.01
frameworkgroup: C1[X(C17H19NO)]
method: RPBEPBE
basis: SDD
operation: Freq
keyword: #p
keyword: freq=noraman
keyword: PBEPBE/SDD
title: #p freq=noraman PBEPBE/SDD
converged: YES YES NO NO
title: Mulliken charges:
elementType: O N C C C C C C C C C C C C C C C C C H H H H H H H H H H H H H H H H H H H
charge: -0.469980 -0.187848 -0.178333 -0.266135 -0.245706 0.410120 -0.628654 0.423194 -0.390849 -0.421683 -0.407770 -0.413294 -0.236117 -0.232052 -0.239541 -0.396803 -0.377219 0.435419 -0.810359 0.273454 0.231223 0.230498 0.242489 0.193363 0.237888 0.278635 0.237174 0.358905 0.252567 0.283295 0.227485 0.226696 0.229285 0.226177 0.225539 0.223172 0.234129 0.221635
chargesum: 0.00000
title: Mulliken charges with hydrogens summed into heavy atoms:
elementType: O N C C C C C C C C C C C C C C C C C
charge: -0.111075 -0.187848 0.095122 -0.034912 -0.015207 0.410120 0.045086 0.423194 -0.112214 -0.184509 -0.155203 -0.129999 -0.008631 -0.005356 -0.010256 -0.170626 -0.151679 0.435419 -0.131424
polarizability: 2.61721696e+02 -2.30582515e+01 1.54649452e+02 -8.88070427e-01 1.33485813e+01 1.58039543e+02
1716.lowfreq: -36.2008 -10.6219 -0.0006 -0.0003 0.0003 1.6788 4.9640 16.4160 27.6648
frequency: -35.9170 16.0761 27.5865 33.6163 54.9547 69.1290 119.6078 139.1470 172.4160 190.7936 199.0376 230.8244 241.3972 308.5338 321.7990 348.0811 361.3368 368.2648 390.1329 406.3596 407.2751 423.8611 475.5314 520.3667 535.8796 567.4458 615.3427 625.3458 636.8115 708.8213 715.0113 732.3269 756.8907 779.2027 797.8805 821.7519 845.9557 858.3953 862.8735 872.8675 925.1408 947.1958 962.7449 976.0152 985.3078 985.6222 988.4983 994.2732 1003.2845 1015.8537 1024.8092 1046.8514 1047.4105 1054.4410 1077.2093 1103.1683 1120.4464 1130.2152 1144.2221 1159.5114 1171.3468 1181.8463 1191.7150 1194.2392 1220.3582 1227.2959 1247.2420 1264.3902 1309.7952 1311.5388 1353.6789 1367.1523 1375.9500 1384.5856 1394.1583 1395.3434 1404.0747 1425.4515 1443.2134 1467.4302 1469.1972 1471.5048 1472.7459 1484.6220 1509.1166 1584.6524 1588.5014 1613.7588 1626.5237 2909.7405 2971.9548 2979.3962 3039.4212 3040.0621 3052.4602 3065.0880 3080.7955 3089.7668 3112.4111 3112.4286 3118.9930 3126.5787 3137.5946 3138.8858 3151.2966 3164.1012 3173.5595 3556.0744
redmass: 1.0219 4.2798 4.1726 4.2583 4.2212 4.5177 3.6219 3.6344 4.0479 1.4193 3.1338 3.5797 2.5091 3.2165 3.1710 1.4244 3.2613 3.8224 3.4779 2.8880 2.8670 3.6051 3.8299 2.9538 3.9735 4.4013 6.4252 4.4778 6.8853 2.0874 3.3519 2.8376 3.3119 2.1696 4.5412 1.5815 3.7921 1.3240 1.2652 3.0268 1.4468 1.8697 1.3808 2.1162 1.3636 1.3608 5.9763 2.5665 1.3172 2.8623 2.1141 1.5582 1.4935 1.8430 1.5877 2.5529 1.3143 1.4936 1.7240 1.4974 1.0588 1.1172 1.1490 2.4675 3.1814 1.4154 1.4299 1.3732 1.2778 1.4383 1.5471 2.0706 3.8374 3.4484 2.0090 1.2267 3.0620 1.3639 2.0143 1.0571 1.0494 1.0523 1.0936 2.4768 2.7700 6.3094 6.0766 6.1044 6.3730 1.0487 1.0385 1.0831 1.0849 1.0815 1.0951 1.0893 1.0996 1.1020 1.0875 1.0874 1.0900 1.0863 1.0965 1.0918 1.0951 1.1012 1.0938 1.0660
irintensity: 0.5439 0.0381 0.4821 0.1039 0.2302 0.2556 0.8811 2.7007 2.7482 1.0429 1.6889 7.4921 1.1746 7.3881 5.7740 88.7470 18.7214 3.4096 6.8612 1.0320 0.5144 1.4883 17.5045 11.8874 12.4488 12.8202 0.0748 3.6716 0.0163 39.7406 3.0387 39.4289 7.8381 47.5534 1.9666 36.9669 9.4457 1.6662 0.5086 2.3315 3.3976 4.2709 3.2902 15.7484 1.2451 0.0621 0.1747 24.5928 1.3265 6.4639 6.9614 18.1800 14.9958 21.6264 6.5634 28.3198 5.9230 10.6193 9.0929 43.4073 0.3030 1.9157 10.2754 17.0840 0.4669 3.6217 0.4227 9.3030 4.6405 5.9443 12.8329 12.8054 0.6638 1.1669 7.1043 8.4969 2.8861 6.7618 11.0705 11.3665 5.3870 12.3222 16.8577 22.4448 42.4699 0.1902 1.5287 16.3229 0.3708 96.6488 45.6868 15.6353 13.1719 31.3332 24.8234 26.2959 18.9174 26.3995 10.0130 14.1738 29.3764 0.3850 14.2198 20.9766 23.4690 25.5893 3.0463 4.3241
temp: 298.150 k
press: 1.00000 atm
elementType: 8 7 6 6 6 6 6 6 6 6 6 6 6 6 6 6 6 6 6 1 1 1 1 1 1 1 1 1 1 1 1 1 1 1 1 1 1 1
symmnumber: 1
zpe: 821973.2 jmol-1
zpe.correction: 0.313073 hartree
zpe.thermalcorrener: 0.330463 hartree
zpe.thermalcorrenthalpy: 0.331407 hartree
zpe.thermalcorrgfe: 0.265684 hartree
zpe.sumelectzpe: -787.757074 hartree
zpe.sumelectthermal: -787.739684 hartree
zpe.sumelectthermalent: -787.738740 hartree
zpe.sumelectthermalfe: -787.804464 hartree
dipole: 1.0962 1.6836 -0.5850
dipole: 2.0924
quadrupole: -101.0726 -110.5409 -107.5857
quadrupole: -5.9433 -3.5557 -1.4771
quadrupole: 5.3271 -4.1411 -1.1860 -5.9433 -3.5557 -1.4771
hfenergy: -788.0701474 hartree
pointgroup: C01 [X(C17H19N1O1)]
dipole: -0.4479342 0.6869409 -0.0719655 debye
polarizability: 259.9057512|22.2426672|145.5110253|-14.4714887|-7.7713336|168.9939146 unknown
InChI: InChI=1S/C17H19NO/c1-12-8-10-14(11-9-12)17(19)16-15(18(16)2)13-6-4-3-5-7-13/h3-11,15-17,19H,1-2H3
charge 0 multiplicity 1
38 atoms
O  0.055435 -0.987651 1.827288
N  -0.74641 1.696392 -0.708475
C  -0.255401 1.091317 0.572928
C  -1.751555 1.40873 0.372725
C  0.285964 -0.337533 0.525956
C  -2.796164 0.358766 0.139048
C  -0.412029 3.119854 -0.958814
C  1.782265 -0.353106 0.236397
C  -2.850761 -0.380268 -1.070493
C  -3.748432 0.083602 1.15721
C  2.249373 0.09222 -1.026252
C  2.722452 -0.77817 1.202906
C  -3.835638 -1.37548 -1.256436
C  -4.730645 -0.914637 0.97207
C  -4.776191 -1.649779 -0.235904
C  3.630873 0.109229 -1.312476
C  4.104671 -0.757907 0.908574
C  4.584262 -0.318149 -0.351239
C  6.06895 -0.333339 -0.675515
H  0.280074 1.749237 1.275432
H  -2.098264 2.272957 0.962801
H  -0.251404 -0.884549 -0.275951
H  0.593743 3.171912 -1.411077
H  -0.414762 3.749656 -0.039262
H  -1.143473 3.537217 -1.67257
H  -2.126144 -0.141923 -1.856498
H  -3.724856 0.658842 2.091839
H  -0.923885 -1.060139 1.962687
H  1.527764 0.424512 -1.782487
H  2.357556 -1.12815 2.172373
H  -3.871424 -1.935909 -2.197571
H  -5.46082 -1.115692 1.76426
H  -5.538908 -2.422936 -0.381282
H  3.976068 0.455183 -2.294991
H  4.822404 -1.091936 1.668554
H  6.683377 -0.186744 0.230562
H  6.36974 -1.301312 -1.12238
H  6.334293 0.457486 -1.39974
