program: Gaussian 09
title: 000288944
version: EM64L-G09RevD.01
frameworkgroup: C1[X(C21H23NO)]
method: RPBEPBE
basis: SDD
operation: Freq
keyword: #p
keyword: freq=noraman
keyword: PBEPBE/SDD
title: #p freq=noraman PBEPBE/SDD
converged: YES YES NO NO
title: Mulliken charges:
elementType: O N C C C C C C C C C C C C C C C C C C C C C H H H H H H H H H H H H H H H H H H H H H H H
charge: -0.228395 -0.093059 -0.350799 -0.361342 -0.397433 -0.395351 -0.398817 -0.531262 0.397159 0.262419 -0.451770 -0.402823 -0.403682 0.039300 -0.229289 -0.239687 0.315189 -0.242880 -0.345149 -0.358239 -0.232822 -0.236947 -0.232675 0.228223 0.174571 0.177592 0.214561 0.201680 0.197073 0.196182 0.202321 0.191200 0.216575 0.229194 0.207505 0.241342 0.258511 0.291690 0.228427 0.224082 0.227417 0.245823 0.275410 0.228932 0.230272 0.229769
chargesum: 0.00000
title: Mulliken charges with hydrogens summed into heavy atoms:
elementType: O N C C C C C C C C C C C C C C C C C C C C C
charge: -0.228395 -0.093059 0.051996 0.030812 0.001319 0.003152 0.008958 -0.094564 0.397159 0.262419 -0.210428 -0.144311 -0.111992 0.039300 -0.000862 -0.015605 0.315189 -0.015463 -0.099326 -0.082829 -0.003890 -0.006675 -0.002906
polarizability: 2.80004225e+02 3.43467516e+00 2.08081378e+02 -3.25734484e+00 -2.27211474e+01 2.15998483e+02
1716.lowfreq: -7.8576 -4.4746 -0.0006 0.0004 0.0007 8.0427 18.0658 24.8119 35.3330
frequency: 17.4407 24.4214 35.3173 44.1758 47.9179 60.3491 80.4566 100.2236 138.5697 152.3327 185.8589 215.2171 224.0621 230.3954 246.1398 284.5773 324.8691 339.1699 382.5847 400.5288 406.0753 408.0593 413.7493 434.6924 449.6615 464.6669 510.2533 538.8768 595.7809 612.5126 613.4503 623.0882 650.0942 695.2819 701.6476 709.0472 729.9182 745.4798 766.3928 779.9185 796.6377 803.4784 850.7196 855.5183 860.2929 864.6636 882.5777 902.6577 940.1444 948.8506 956.7521 984.7339 986.2669 988.5649 989.3012 990.1537 991.3617 1006.1518 1009.1408 1021.6256 1024.0370 1042.7448 1059.1707 1067.0000 1082.2480 1087.7298 1089.2816 1095.7667 1120.8356 1148.0243 1151.0016 1172.5149 1172.9595 1182.7755 1191.1411 1193.0627 1207.3585 1251.6393 1263.5452 1271.5855 1277.4822 1287.2393 1314.1385 1319.1486 1326.5793 1335.9355 1339.8813 1348.6805 1361.1290 1364.1431 1373.0074 1386.1971 1386.6362 1433.0373 1433.9184 1450.9256 1459.9125 1460.8309 1467.2741 1470.1772 1475.3575 1479.2661 1481.8554 1523.3470 1575.1775 1589.0450 1607.2186 1608.5021 1616.6276 2824.8966 2834.6830 2866.2248 2968.6465 2983.8207 2984.8595 3019.4209 3024.2399 3033.5746 3038.3549 3044.7526 3054.1137 3095.9343 3120.0263 3126.2568 3128.0860 3137.6635 3137.9392 3147.9438 3150.0009 3159.6870 3163.1108 3168.9697
redmass: 3.7669 4.6653 4.3701 4.0716 4.3425 3.8574 5.3518 4.3478 4.6370 3.6959 4.6114 3.1523 3.5356 4.9717 2.2450 2.6931 2.9895 3.0364 1.8043 4.0883 3.1089 3.1174 4.1539 3.3684 3.0566 4.3378 3.4491 1.9665 4.4033 5.4239 6.2332 3.7853 4.7112 2.9248 2.1105 1.9241 3.2643 3.1989 3.2953 2.0833 2.0576 1.5344 2.1341 1.6675 1.2500 1.2441 1.7862 2.3014 1.3984 1.4510 1.2995 2.4917 2.8520 2.6080 2.2157 1.9359 1.8754 1.3458 1.3182 2.4274 2.7635 2.2843 2.3493 2.2694 1.4829 1.7454 1.7748 2.5058 2.5300 1.8486 1.5253 1.0600 1.0552 1.1521 1.2827 1.1239 2.1167 1.3788 1.2667 1.3944 2.4199 1.4132 1.3602 1.3774 1.2745 1.3791 1.4412 1.5120 1.4245 1.7934 6.1145 1.5462 6.1289 2.2837 2.3153 1.0919 1.0874 1.0920 1.0928 1.1067 2.1949 1.6089 1.3665 8.7059 5.7990 6.3533 5.9977 6.0003 8.4331 1.0716 1.0704 1.0696 1.0630 1.0615 1.0615 1.0892 1.0875 1.0910 1.0917 1.1030 1.1038 1.0875 1.0860 1.0850 1.0878 1.0885 1.0923 1.0960 1.0925 1.0957 1.1013 1.1004
irintensity: 0.2615 1.9542 0.4977 0.2825 0.6544 0.3028 2.3760 1.2137 1.9810 2.3619 3.5625 0.6680 1.9150 10.1008 0.4443 1.4924 1.7769 1.4086 1.7279 0.6552 0.5534 0.0320 2.2471 0.8263 0.8936 5.4101 7.8481 3.4743 17.6035 0.3572 0.2499 0.0843 21.7681 14.4125 46.4440 36.8497 22.8598 3.4734 3.5022 62.5706 34.8910 2.0890 5.6346 10.1692 2.7427 0.7613 52.9057 5.0073 9.8643 3.0400 3.7576 37.4154 2.1416 17.2699 0.7805 1.8612 3.3662 0.8757 0.5954 5.4525 4.6675 13.8110 2.6003 6.3812 16.7571 2.8567 6.1442 40.6187 3.4977 9.5936 11.8282 1.3619 0.6663 22.7577 2.7004 3.9123 28.8869 6.8903 1.4678 29.9705 162.6997 20.4063 11.8422 5.6475 16.8250 5.4361 1.1410 1.5059 6.1751 20.5528 2.2431 3.1046 1.3025 14.9014 6.9304 6.9456 13.3066 5.1115 10.8725 8.1279 0.7939 4.9910 11.8024 171.5614 7.1600 5.9744 11.5043 4.4616 71.1764 38.7680 131.5864 127.4441 41.4554 29.6352 24.2520 0.5055 75.8349 68.3757 23.9598 22.1237 95.1681 6.6030 4.6989 0.3801 4.6585 6.4762 3.5636 29.2409 14.9644 24.9471 31.2429 16.3109
temp: 298.150 k
press: 1.00000 atm
elementType: 8 7 6 6 6 6 6 6 6 6 6 6 6 6 6 6 6 6 6 6 6 6 6 1 1 1 1 1 1 1 1 1 1 1 1 1 1 1 1 1 1 1 1 1 1 1
symmnumber: 1
zpe: 1008769.8 jmol-1
zpe.correction: 0.384220 hartree
zpe.thermalcorrener: 0.404708 hartree
zpe.thermalcorrenthalpy: 0.405652 hartree
zpe.thermalcorrgfe: 0.332456 hartree
zpe.sumelectzpe: -942.319211 hartree
zpe.sumelectthermal: -942.298723 hartree
zpe.sumelectthermalent: -942.297779 hartree
zpe.sumelectthermalfe: -942.370975 hartree
dipole: 2.6125 1.2083 -3.0144
dipole: 4.1679
quadrupole: -122.4849 -136.8463 -138.8486
quadrupole: -6.9989 10.2245 3.4463
quadrupole: 10.2417 -4.1197 -6.1220 -6.9989 10.2245 3.4463
hfenergy: -942.7034312 hartree
pointgroup: C01 [X(C21H23N1O1)]
dipole: -0.999453 -0.2985184 1.2652641 debye
polarizability: 267.4159959|29.8898727|209.7359438|-10.8506588|14.351369|226.9321461 unknown
InChI: InChI=1S/C21H23NO/c23-21(19-12-6-2-7-13-19)16-20(18-10-4-1-5-11-18)17-22-14-8-3-9-15-22/h1-2,4-7,10-13,16H,3,8-9,14-15,17H2
charge 0 multiplicity 1
46 atoms
O  2.496071 0.140918 -3.024976
N  -2.572446 -1.253281 -0.523172
C  -1.890102 -2.57328 -0.510077
C  -4.05059 -1.402227 -0.607384
C  -2.367633 -3.432692 0.677364
C  -4.593694 -2.229903 0.57481
C  -3.902333 -3.610695 0.643077
C  -2.048611 -0.348878 -1.584308
C  -0.641492 0.178577 -1.276864
C  -0.526939 1.290341 -0.290193
C  0.409189 -0.339606 -1.993825
C  0.344642 2.389669 -0.53495
C  -1.327737 1.307707 0.887529
C  1.873485 -0.037634 -1.925635
C  0.43633 3.456496 0.383043
C  -1.233362 2.376337 1.803721
C  2.627191 -0.038319 -0.624401
C  -0.348027 3.452921 1.559859
C  2.089596 -0.577147 0.573986
C  3.954897 0.46961 -0.622718
C  2.864742 -0.601426 1.752942
C  4.724604 0.453645 0.556442
C  4.180685 -0.082974 1.749401
H  -0.799795 -2.405654 -0.449653
H  -2.084407 -3.126156 -1.468078
H  -4.34869 -1.897879 -1.569294
H  -4.501486 -0.39195 -0.604223
H  -2.072753 -2.934362 1.62154
H  -1.858612 -4.415037 0.644701
H  -5.689423 -2.34482 0.467489
H  -4.405833 -1.675483 1.515043
H  -4.182528 -4.206383 -0.250522
H  -4.249221 -4.175197 1.528945
H  -2.745945 0.506799 -1.659425
H  -2.037016 -0.857603 -2.580766
H  0.169137 -1.025031 -2.819876
H  0.926276 2.422001 -1.462604
H  -1.99902 0.460521 1.068145
H  1.112045 4.293741 0.175843
H  -1.847632 2.368359 2.71154
H  -0.276035 4.282059 2.272864
H  1.071464 -0.978726 0.581726
H  4.358194 0.862887 -1.561978
H  2.444231 -1.021153 2.673384
H  5.744764 0.853184 0.550705
H  4.779217 -0.099075 2.667424
