program: Gaussian 09
title: 000288932
version: EM64L-G09RevD.01
frameworkgroup: C1[X(C19H21NO2)]
method: RPBEPBE
basis: SDD
operation: Freq
keyword: #p
keyword: freq=noraman
keyword: PBEPBE/SDD
title: #p freq=noraman PBEPBE/SDD
converged: YES YES NO NO
title: Mulliken charges:
elementType: O O N C C C C C C C C C C C C C C C C C C C H H H H H H H H H H H H H H H H H H H H H
charge: -0.277069 -0.228436 -0.159636 -0.273143 -0.260498 0.012527 0.458539 0.230356 -0.698262 -0.700108 -0.433911 -0.364028 -0.410767 -0.411449 0.348604 -0.503385 0.337281 -0.396141 -0.398606 -0.237507 -0.237346 -0.243259 0.232028 0.260101 0.171082 0.206665 0.230963 0.225785 0.222514 0.207286 0.232825 0.226970 0.283408 0.236022 0.238411 0.240911 0.232294 0.243225 0.241860 0.236781 0.224703 0.223979 0.228432
chargesum: 0.00000
title: Mulliken charges with hydrogens summed into heavy atoms:
elementType: O O N C C C C C C C C C C C C C C C C C C C
charge: -0.277069 -0.228436 -0.159636 -0.041115 -0.000397 0.183608 0.458539 0.230356 -0.034849 -0.037483 -0.206941 -0.080620 -0.174744 -0.173039 0.348604 0.213045 0.337281 -0.154281 -0.161825 -0.012803 -0.013367 -0.014827
polarizability: 3.43528355e+02 4.10758277e+00 1.80654835e+02 -7.16942121e+00 -2.13030801e+01 1.75988526e+02
1716.lowfreq: -7.6672 -3.4529 -0.0005 -0.0003 0.0004 3.3155 20.6676 26.6065 39.5084
frequency: 20.6013 26.4043 39.5011 55.4490 66.3466 71.8807 86.3391 87.9883 100.6008 117.6976 145.1711 165.7745 193.9030 196.8189 229.5952 234.9950 262.3448 273.8404 296.5826 329.9514 338.8105 376.1940 404.5862 407.9558 414.1017 441.4615 476.2877 508.3124 523.2154 559.5010 594.1876 614.1606 626.0782 637.1350 684.6501 701.0376 703.0446 742.9054 756.6842 773.6740 799.7789 837.6024 848.9369 854.1507 855.3999 878.4606 897.1166 919.3851 924.2417 929.5155 953.9143 958.8223 973.3572 980.3544 985.7138 988.4760 992.7248 996.4751 1018.8516 1023.7197 1040.5090 1072.8251 1084.0344 1113.2671 1118.1062 1122.6461 1131.1319 1147.2471 1148.4096 1170.8953 1172.6633 1187.6747 1190.2225 1201.9932 1249.6764 1289.9628 1304.2100 1314.2755 1318.7253 1328.6883 1350.5547 1372.6887 1376.8826 1381.0812 1394.7096 1405.5155 1420.7462 1425.2706 1440.5280 1451.5768 1458.6118 1464.7591 1467.1146 1472.6898 1477.7657 1486.8014 1519.3223 1565.8784 1587.8784 1612.4188 1623.6790 1649.3980 2856.7121 2984.6549 2987.6859 3002.6789 3018.3124 3078.6663 3080.6736 3084.9566 3089.0723 3094.9174 3103.7307 3111.7350 3121.3199 3125.8884 3135.7703 3139.1967 3144.2981 3147.0292 3147.9981 3164.0177 3177.8547
redmass: 4.5456 4.1053 4.6196 3.4990 3.5928 3.7866 2.7518 2.1302 1.7832 4.2549 4.0208 4.7895 4.6139 1.0399 2.0018 1.7423 3.8946 3.7171 3.5773 3.7339 4.2384 4.2701 2.8579 3.0648 3.1231 4.7373 2.9864 3.5862 3.7538 2.7517 5.1556 6.4865 4.9003 6.7784 4.8210 1.8574 4.2129 2.8025 6.5895 2.1388 3.3907 1.5638 1.2818 1.4704 3.2631 4.9730 3.9529 1.4829 1.1716 2.9957 1.5293 1.3992 1.4276 1.4345 3.9074 4.4202 1.3134 6.4413 2.7026 1.4785 1.8870 1.2954 1.6203 1.2779 1.9341 2.5411 1.8002 2.0304 1.5225 2.0227 1.0532 2.2237 1.1144 1.1536 1.5202 2.9712 1.4352 1.4905 1.4471 1.3719 2.3401 2.7925 2.5577 1.3284 1.3066 2.2667 2.0161 1.4527 2.3616 1.0502 1.0465 1.0516 1.0491 1.0532 2.2156 1.0542 2.9648 5.9233 6.4654 6.0471 6.2847 10.0286 1.0821 1.0351 1.0358 1.0296 1.0854 1.0905 1.0966 1.0993 1.1005 1.0996 1.1044 1.0879 1.0844 1.0875 1.0898 1.0924 1.0944 1.1046 1.0962 1.1016 1.0946
irintensity: 0.1496 0.4837 1.3224 0.9404 0.4076 0.1944 0.1822 0.0802 0.5110 1.1920 1.5572 6.7199 2.4015 0.0297 2.9474 0.3746 7.7090 6.0314 2.0745 0.9885 2.8646 1.9175 0.1032 0.5309 0.2383 1.5328 5.8483 5.6035 5.3203 5.7278 1.0998 0.1614 17.1513 1.0845 20.5778 35.4051 16.1739 53.7755 2.3595 36.6599 7.0379 18.3792 0.1237 12.3484 1.2024 8.2871 22.6373 1.8834 3.5956 3.6661 0.2879 0.3298 0.3153 2.5570 1.6871 0.7576 0.0553 11.8077 1.3754 37.2473 6.7605 11.6022 8.8422 5.7339 93.1417 309.3096 42.1283 0.4721 1.5557 4.0110 0.0396 49.5264 0.2466 9.6104 2.7550 1.2745 5.9807 13.4980 10.6384 68.2952 9.8688 13.2192 11.9268 49.6420 22.6803 35.5390 8.1146 46.9988 3.3305 13.4877 5.2487 11.0777 2.5143 12.6946 42.2985 10.5236 5.4004 2.4572 1.2370 10.8540 1.5385 106.4654 75.0795 30.7715 19.7604 36.5040 21.8238 8.9207 23.8360 60.0706 1.9527 56.8146 27.1413 21.0811 6.2748 2.1313 15.3391 13.2992 4.9771 18.8223 49.0093 30.1120 0.9137
temp: 298.150 k
press: 1.00000 atm
elementType: 8 8 7 6 6 6 6 6 6 6 6 6 6 6 6 6 6 6 6 6 6 6 1 1 1 1 1 1 1 1 1 1 1 1 1 1 1 1 1 1 1 1 1
symmnumber: 1
zpe: 920005.9 jmol-1
zpe.correction: 0.350412 hartree
zpe.thermalcorrener: 0.371857 hartree
zpe.thermalcorrenthalpy: 0.372801 hartree
zpe.thermalcorrgfe: 0.297844 hartree
zpe.sumelectzpe: -940.188383 hartree
zpe.sumelectthermal: -940.166938 hartree
zpe.sumelectthermalent: -940.165994 hartree
zpe.sumelectthermalfe: -940.240951 hartree
dipole: -1.5371 -0.2172 2.1051
dipole: 2.6156
quadrupole: -111.6465 -119.8485 -127.4033
quadrupole: 1.9928 -4.1771 -4.2708
quadrupole: 7.9863 -0.2157 -7.7705 1.9928 -4.1771 -4.2708
hfenergy: -940.5387947 hartree
pointgroup: C01 [X(C19H21N1O2)]
dipole: -0.6221971 0.0785023 0.815883 debye
polarizability: 343.6457956|-6.4168854|174.2865711|-4.8230164|-20.6851571|182.2393486 unknown
InChI: InChI=1S/C19H21NO2/c1-13(2)20-17(18(20)19(21)22-3)16-11-9-15(10-12-16)14-7-5-4-6-8-14/h4-13,17-18H,1-3H3
charge 0 multiplicity 1
43 atoms
O  -3.243825 2.944015 0.303842
O  -2.152007 1.829471 -1.435449
N  -3.124964 -0.756818 -0.225871
C  -2.187129 -0.493043 0.903618
C  -3.206661 0.58984 0.421826
C  -4.274058 -1.683985 0.038733
C  -0.713019 -0.456587 0.665073
C  -2.798834 1.790817 -0.366435
C  -3.777283 -3.128864 -0.151337
C  -5.420801 -1.322699 -0.922098
C  0.168728 -0.460871 1.777061
C  -0.159974 -0.426654 -0.640661
C  1.564369 -0.430302 1.592206
C  1.235915 -0.402815 -0.82088
C  2.128955 -0.398943 0.287064
C  -2.86924 4.228056 -0.333757
C  3.606327 -0.366538 0.086871
C  4.179938 0.325652 -1.01626
C  4.485185 -1.024113 0.992496
C  5.577589 0.358263 -1.207778
C  5.883241 -0.990806 0.803776
C  6.438303 -0.299358 -0.298197
H  -2.47369 -0.900177 1.889648
H  -4.02607 0.781795 1.129581
H  -4.632543 -1.561322 1.093016
H  -4.596014 -3.846642 0.036726
H  -3.414203 -3.271557 -1.184373
H  -2.945907 -3.360618 0.538743
H  -5.758239 -0.281231 -0.769179
H  -6.284741 -1.992922 -0.763784
H  -5.08303 -1.423046 -1.968561
H  -0.24129 -0.478675 2.795064
H  -0.839489 -0.429934 -1.497178
H  2.222695 -0.401898 2.467798
H  1.641251 -0.413521 -1.838757
H  -3.277248 4.281492 -1.357319
H  -3.309878 5.00149 0.310812
H  -1.771272 4.325222 -0.378375
H  3.527763 0.866322 -1.711541
H  4.068838 -1.591456 1.832817
H  5.995567 0.904735 -2.06086
H  6.538983 -1.512568 1.510153
H  7.52366 -0.273806 -0.445877
