program: Gaussian 09
title: 000027699
version: EM64L-G09RevD.01
frameworkgroup: C1[X(C23H18N2O2)]
method: RPBEPBE
basis: SDD
operation: Freq
keyword: #p
keyword: freq=noraman
keyword: PBEPBE/SDD
title: #p freq=noraman PBEPBE/SDD
converged: YES YES NO NO
title: Mulliken charges:
elementType: O O N N C C C C C C C C C C C C C C C C C C C C C C C H H H H H H H H H H H H H H H H H H
charge: -0.359576 -0.252837 -0.008013 -0.370795 -0.038967 0.367792 0.340146 0.142915 0.320250 -0.375930 -0.372733 -0.376135 -0.372808 -0.354116 -0.354525 -0.353705 -0.353497 0.411118 -0.227358 -0.221765 -0.227452 -0.221719 -0.235010 -0.236338 -0.253244 0.267908 -0.601914 0.222935 0.229351 0.222985 0.229376 0.237391 0.237524 0.248224 0.248215 0.228516 0.228264 0.228504 0.228263 0.230674 0.230576 0.334072 0.230818 0.271498 0.231120
chargesum: 0.00000
title: Mulliken charges with hydrogens summed into heavy atoms:
elementType: O O N N C C C C C C C C C C C C C C C C C C C C C C C
charge: -0.359576 -0.252837 -0.008013 -0.036723 -0.038967 0.367792 0.340146 0.142915 0.320250 -0.152994 -0.143382 -0.153150 -0.143432 -0.116725 -0.117001 -0.105481 -0.105282 0.411118 0.001158 0.006499 0.001052 0.006544 -0.004336 -0.005761 -0.253244 0.267908 0.131523
polarizability: 3.38133863e+02 -2.49492540e+01 2.29209338e+02 4.02297314e-02 5.21894240e-02 2.16482672e+02
1716.lowfreq: -60.2675 -51.5128 -38.8641 -19.9490 -6.1180 -3.5590 -0.0008 -0.0007 0.0005
frequency: -60.2673 -51.5062 -38.8447 -19.6494 20.4009 23.3849 42.3976 49.3849 58.6679 73.4116 92.8924 96.0803 133.1624 141.5917 154.5587 174.9352 208.7576 249.5092 250.6894 251.3704 309.5918 351.4698 351.7129 385.0984 389.2861 394.8970 403.1795 415.1237 443.1257 473.3153 510.2724 540.2705 577.0145 587.6555 598.0526 612.7268 613.4680 634.6983 638.6171 646.5517 667.2957 685.0283 694.8618 704.1616 726.0649 736.2993 747.1013 753.9563 788.1863 827.7640 833.5102 842.5414 848.8979 849.6912 882.0992 891.3126 912.8662 927.7598 952.2100 963.5353 968.9476 972.9969 987.8064 988.9507 993.8208 995.0846 1006.1700 1022.7761 1028.2888 1044.1980 1069.2817 1075.6850 1083.5944 1103.3068 1126.2727 1145.5444 1158.5517 1173.6405 1174.2105 1177.5837 1179.5576 1186.8274 1190.7914 1216.4318 1256.7504 1291.1353 1297.8365 1302.9083 1315.7482 1357.7258 1366.3606 1371.9460 1399.6302 1426.3381 1430.9074 1431.2857 1458.2083 1474.7528 1478.8162 1483.3656 1490.7630 1515.7343 1581.6326 1585.5744 1588.2999 1599.9491 1607.9688 1612.3889 1625.2436 1709.6768 2160.9488 2982.3510 3061.2451 3113.5395 3124.5187 3125.8888 3126.2379 3129.7253 3140.0542 3141.1117 3141.7908 3143.0476 3150.4116 3151.7639 3167.5612 3167.9652 3168.2728 3172.3351 3576.1872
redmass: 3.9429 3.9174 4.5939 4.6569 5.7716 5.1704 5.2164 5.3462 6.2434 5.4653 9.4044 1.1159 5.1413 6.6147 3.5149 6.5640 4.7097 4.7887 4.7951 4.5344 6.4927 9.2464 5.3579 7.3568 2.8072 2.8348 2.9467 5.5486 6.0911 3.6594 3.9345 3.5674 7.9436 1.1114 5.7145 6.5313 6.7469 6.2953 7.4194 4.4448 6.0476 12.1420 1.8515 1.6869 9.2217 3.8800 1.7653 2.5025 3.5596 1.2477 3.2115 1.2519 2.3634 1.2450 4.0949 3.1127 1.5957 1.6938 1.4040 1.3779 1.3927 1.3845 6.2456 6.1830 1.3224 1.3193 3.6958 2.6900 2.1863 2.8935 5.3925 1.6150 1.5998 1.3258 1.2823 1.7869 2.0098 1.0519 1.0515 3.4624 1.3979 1.1123 1.1208 2.3438 4.7131 1.2608 4.6134 1.4184 1.3535 5.8545 5.8668 7.2224 3.6681 2.2259 1.1588 2.2383 1.3751 2.2109 2.4160 1.0441 2.2668 1.4657 5.9594 6.0714 7.6747 7.4697 6.2029 6.4394 8.8333 9.6722 12.6471 1.0351 1.1028 1.0985 1.0851 1.0847 1.0879 1.0878 1.0917 1.0895 1.0921 1.0895 1.0965 1.0967 1.1017 1.1017 1.0962 1.0972 1.0772
irintensity: 0.0400 0.1883 1.2543 1.1492 0.8919 2.5444 2.7033 0.8180 0.7200 1.5435 1.9744 0.1835 3.3102 1.9937 0.4896 0.4942 1.3695 0.1103 4.6619 0.0805 11.1790 0.8016 9.0837 1.8619 0.0136 0.0113 0.2992 1.7030 4.1016 3.2349 26.8094 6.0445 0.1657 127.4086 27.9502 0.0392 0.0921 7.1438 0.7942 6.1778 6.9543 22.7330 25.6028 87.3749 0.0314 4.3785 26.9056 56.9964 3.9313 0.6530 17.0806 0.2713 14.9562 0.0615 97.9758 1.2768 0.3189 0.4802 1.4762 0.0152 0.0183 0.0200 2.3376 5.2140 0.0003 0.2140 38.1222 9.0453 5.8475 18.8464 230.8643 0.1120 21.2778 11.2806 0.1319 201.1252 285.2027 0.0066 0.0099 3.8109 131.2337 0.0553 1.0336 5.3686 29.2694 1.0582 3.3925 0.0154 2.3306 0.0079 0.0281 0.0000 4.0931 0.0470 29.1411 16.5643 222.6072 3.9535 12.8165 14.3312 99.0188 112.4880 0.0745 4.9629 0.7579 10.4536 3.9536 3.7969 4.6296 292.2029 17.9297 87.0225 34.9904 4.4084 7.2008 2.5926 0.0401 0.0267 11.7011 2.2733 16.0479 10.6960 9.5075 55.3854 30.9975 16.4935 8.4807 2.4216 45.3581
temp: 298.150 k
press: 1.00000 atm
elementType: 8 8 7 7 6 6 6 6 6 6 6 6 6 6 6 6 6 6 6 6 6 6 6 6 6 6 6 1 1 1 1 1 1 1 1 1 1 1 1 1 1 1 1 1 1
symmnumber: 1
zpe: 904428.8 jmol-1
zpe.correction: 0.344479 hartree
zpe.thermalcorrener: 0.365704 hartree
zpe.thermalcorrenthalpy: 0.366648 hartree
zpe.thermalcorrgfe: 0.292075 hartree
zpe.sumelectzpe: -1145.316903 hartree
zpe.sumelectthermal: -1145.295678 hartree
zpe.sumelectthermalent: -1145.294734 hartree
zpe.sumelectthermalfe: -1145.369307 hartree
dipole: -3.2582 2.8899 0.0029
dipole: 4.3551
quadrupole: -113.3261 -174.5682 -137.2236
quadrupole: 14.6843 -0.0166 0.0443
quadrupole: 28.3799 -32.8622 4.4824 14.6843 -0.0166 0.0443
hfenergy: -1145.661382 hartree
pointgroup: C01 [X(C23H18N2O2)]
dipole: 1.3031517 1.1125177 -0.0013394 debye
polarizability: 339.038978|22.8704283|228.3041729|0.0482654|-0.0539429|216.482722 unknown
InChI: InChI=1S/C23H18N2O2/c1-25-23(26)27-20-14-12-17(13-15-20)21(16-24)22(18-8-4-2-5-9-18)19-10-6-3-7-11-19/h2-15,25H,1H3
charge 0 multiplicity 1
45 atoms
O  4.62824 -1.345652 -0.001765
O  4.91379 1.018866 0.005288
N  -2.201731 -3.573748 -0.001378
N  6.72617 -0.488078 0.001037
C  -1.884174 -0.023432 -0.000293
C  -1.264084 1.34606 -0.000931
C  -3.387793 -0.083397 0.000235
C  -1.118713 -1.165581 -0.000018
C  0.389458 -1.169523 -0.000438
C  -0.985558 2.009426 1.221463
C  -4.106695 -0.096169 -1.222402
C  -0.990544 2.010521 -1.223857
C  -4.105699 -0.095552 1.22346
C  1.105292 -1.188341 -1.223311
C  1.105859 -1.192175 1.222043
C  2.515761 -1.214917 -1.228786
C  2.51632 -1.218797 1.226793
C  3.205456 -1.230399 -0.00118
C  -0.436268 3.310038 1.219878
C  -5.518479 -0.127064 -1.220777
C  -0.441224 3.311122 -1.223353
C  -5.517486 -0.126443 1.222994
C  -0.162921 3.965659 -0.002005
C  -6.228464 -0.140543 0.001401
C  -1.739966 -2.469013 0.000787
C  5.399524 -0.13335 0.001845
C  7.798605 0.509777 0.002673
H  -1.193703 1.505144 2.172114
H  -3.560883 -0.092156 -2.172687
H  -1.202639 1.507122 -2.174105
H  -3.559111 -0.091008 2.173296
H  0.558074 -1.184192 -2.171946
H  0.559065 -1.19105 2.170932
H  3.078945 -1.225893 -2.166647
H  3.079932 -1.232724 2.164359
H  -0.217149 3.807747 2.170841
H  -6.062021 -0.145594 -2.17175
H  -0.226002 3.809683 -2.174763
H  -6.060251 -0.144469 2.174419
H  0.266937 4.973063 -0.002425
H  -7.323565 -0.166587 0.001849
H  6.943017 -1.48497 -0.002424
H  8.441243 0.404854 0.895868
H  7.334626 1.508629 0.017866
H  8.426209 0.425802 -0.903498
