program: Gaussian 09
title: 000288919
version: EM64L-G09RevD.01
frameworkgroup: C1[X(C21H20N2)]
method: RPBEPBE
basis: SDD
operation: Freq
keyword: #pfreq=noraman
keyword: PBEPBE/SDD
title: #p freq=noraman PBEPBE/SDD
converged: YES YES NO NO
title: Mulliken charges:
elementType: N N C C C C C C C C C C C C C C C C C C C C C H H H H H H H H H H H H H H H H H H H H
charge: -0.067612 0.032929 -0.391159 -0.358630 -0.355590 -0.392949 -0.388891 0.352594 0.326038 -0.404777 0.285763 -0.414724 -0.497806 -0.441667 -0.430981 0.435615 -0.038901 -0.230439 -0.229372 -0.417019 -0.333310 -0.254897 -0.232361 0.246596 0.234794 0.186783 0.167629 0.207477 0.204850 0.194365 0.190687 0.204145 0.190201 0.215261 0.253239 0.264176 0.275567 0.226501 0.228485 0.233998 0.263959 0.228665 0.230767
chargesum: 0.00000
title: Mulliken charges with hydrogens summed into heavy atoms:
elementType: N N C C C C C C C C C C C C C C C C C C C C C
charge: -0.067612 0.032929 -0.144562 0.062947 0.019517 0.006266 0.005940 0.352594 0.326038 0.000685 0.285763 -0.414724 -0.244567 -0.177492 -0.155414 0.435615 -0.038901 -0.003938 -0.000887 -0.183021 -0.069351 -0.026232 -0.001594
polarizability: 3.54281780e+02 -4.77223431e+01 2.71052895e+02 2.23414134e+01 2.35976176e+01 1.39831049e+02
1716.lowfreq: -10.3590 -4.5826 0.0003 0.0004 0.0005 4.0500 34.7404 43.7967 65.5708
frequency: 34.7322 43.7403 65.5011 68.2406 97.3014 133.9013 147.5185 168.2195 210.0349 230.1028 268.2900 273.4854 288.9443 313.9978 333.1202 368.7050 385.4442 399.8264 444.5254 448.8816 460.2691 478.4430 499.0196 534.0177 540.3567 564.3921 576.9074 611.8717 625.2760 645.6777 685.3851 709.4507 737.6294 754.2378 762.8153 782.1202 785.2465 800.8317 809.0547 833.4883 842.7680 851.8710 866.2178 875.7616 885.6514 894.1264 919.1319 934.0249 959.5712 964.3411 966.5099 989.0195 993.5163 995.6409 998.7390 1017.6521 1023.4786 1042.2465 1077.8987 1079.3633 1101.0182 1107.3477 1120.1773 1127.4808 1148.0516 1156.2577 1160.9226 1168.2301 1173.0226 1194.6304 1199.3167 1209.7220 1243.1079 1252.5030 1260.2422 1265.4318 1293.9385 1295.2025 1299.2979 1313.3154 1331.5070 1340.0700 1347.6534 1357.2865 1370.1536 1377.5283 1389.8553 1399.5697 1412.5736 1444.0935 1453.5140 1456.3448 1461.4432 1464.1915 1468.9200 1475.0494 1479.5588 1503.9813 1556.1787 1592.8763 1613.5812 1615.9330 1624.6014 2839.7535 2866.2276 2960.7976 2967.6311 2985.1977 2987.3436 3016.2324 3033.8307 3041.4898 3047.2303 3055.8898 3116.9527 3126.5606 3131.0546 3135.2303 3141.0465 3153.4124 3153.9328 3166.2007 3168.3405
redmass: 4.3629 3.5289 3.4052 4.6934 3.9654 4.0623 4.1348 3.9424 3.2600 2.8345 4.7852 2.9457 2.6596 5.1908 3.9855 4.9156 1.8869 3.6623 3.1748 3.1660 3.0255 2.8987 2.5899 5.9082 5.5000 3.4815 5.2775 5.4478 3.9185 5.3721 4.9126 5.6107 3.6915 1.9558 1.4256 2.5909 2.4766 3.7677 1.5272 3.5738 3.1735 1.7181 2.4329 1.5599 3.3183 1.7100 1.9977 1.9198 1.3025 1.4492 1.4272 3.7628 1.3293 1.3511 3.2154 2.1526 2.1411 2.1551 1.4356 2.4296 1.9382 2.5235 2.8043 1.8418 1.2752 1.7733 1.3154 1.2061 1.1691 1.9634 1.7035 1.8752 2.3331 2.0313 1.3313 1.2018 1.8581 1.7923 1.8389 1.4385 1.3131 1.4107 1.4771 1.4376 1.9717 2.1611 2.6683 8.2229 3.6371 2.6749 1.0929 2.6167 1.0879 1.0957 1.0847 3.5602 1.1035 4.4187 8.4185 7.2696 7.8136 6.7915 7.1809 1.0695 1.0700 1.0820 1.0625 1.0622 1.0611 1.0876 1.0960 1.0895 1.1031 1.1037 1.0877 1.0854 1.0921 1.0885 1.0902 1.0944 1.0953 1.0996 1.0996
irintensity: 0.1655 0.2715 0.7624 1.2863 0.0203 0.7438 0.2236 1.7689 2.1295 0.9097 1.1004 0.8469 2.7837 0.9734 1.5648 0.4024 4.4154 0.1685 1.2660 3.6368 2.3160 8.2654 0.4745 1.1127 4.9238 1.3691 6.0017 2.9276 2.1551 0.8704 1.8499 0.1492 12.6359 36.8285 47.1880 28.4613 48.0666 9.3477 0.3493 1.5272 2.7294 4.9487 6.0903 7.2354 0.7397 1.0461 2.7845 15.0538 1.7943 3.3955 12.9567 23.6638 0.2229 0.3884 12.3790 10.0441 1.9764 2.9841 5.1388 18.7690 15.6075 14.8182 3.3182 4.7474 6.8083 3.9609 12.4777 7.4834 0.2193 5.4003 6.6389 1.8743 5.9748 15.1602 2.2995 3.5732 3.2995 2.6923 3.3373 25.1288 0.5655 0.3041 0.2866 4.8077 13.2254 5.1958 26.0483 9.4239 24.8419 3.6815 5.8677 10.9848 15.3174 16.7110 2.8020 5.4840 8.0942 12.2229 28.7081 7.7474 35.1948 0.6231 1.8366 61.5777 63.4545 13.3285 34.1938 36.9708 34.3314 59.5851 75.0946 19.4993 12.6419 78.4430 5.3145 0.6727 11.3652 12.5603 12.3827 29.1104 17.7128 32.9755 30.6502
temp: 298.150 k
press: 1.00000 atm
elementType: 7 7 6 6 6 6 6 6 6 6 6 6 6 6 6 6 6 6 6 6 6 6 6 1 1 1 1 1 1 1 1 1 1 1 1 1 1 1 1 1 1 1 1
symmnumber: 1
zpe: 932002.0 jmol-1
zpe.correction: 0.354981 hartree
zpe.thermalcorrener: 0.372684 hartree
zpe.thermalcorrenthalpy: 0.373628 hartree
zpe.thermalcorrgfe: 0.309173 hartree
zpe.sumelectzpe: -920.142664 hartree
zpe.sumelectthermal: -920.124961 hartree
zpe.sumelectthermalent: -920.124017 hartree
zpe.sumelectthermalfe: -920.188472 hartree
dipole: -1.0420 -2.2861 -0.5075
dipole: 2.5631
quadrupole: -123.8124 -124.5925 -136.4950
quadrupole: -6.0760 1.8088 4.3510
quadrupole: 4.4875 3.7075 -8.1950 -6.0760 1.8088 4.3510
hfenergy: -920.497645 hartree
pointgroup: C01 [X(C21H20N2)]
dipole: 0.1795885 -0.9708694 0.2050716 debye
polarizability: 372.6643014|21.3977898|252.7038531|10.1878567|-30.0016265|139.797569 unknown
InChI: InChI=1S/C21H20N2/c1-6-12-23(13-7-1)21-17-10-4-3-9-16(17)20-18(21)14-15-8-2-5-11-19(15)22-20/h2-5,8-11,14,21H,1,6-7,12-13H2
charge 0 multiplicity 1
43 atoms
N  1.794595 -1.499187 0.315617
N  -1.682744 1.812126 -0.328571
C  1.141085 -0.315203 0.931806
C  1.658713 -1.590539 -1.160921
C  1.506131 -2.791132 0.98295
C  2.636047 -2.643797 -1.723204
C  2.484863 -3.878526 0.489908
C  -0.348622 -0.058541 0.618138
C  1.784464 1.005002 0.484149
C  2.410527 -4.01726 -1.048964
C  0.809121 1.915991 -0.007295
C  -0.51534 1.268887 0.055868
C  -1.475724 -0.848487 0.793016
C  3.14326 1.360311 0.511058
C  1.174159 3.201301 -0.460924
C  -2.756495 -0.328037 0.386289
C  -2.81412 1.011642 -0.174943
C  3.517058 2.649688 0.055846
C  2.540053 3.562605 -0.422151
C  -3.968821 -1.075848 0.518494
C  -4.078414 1.541931 -0.582086
C  -5.191962 -0.53232 0.112419
C  -5.245828 0.784765 -0.44273
H  1.26657 -0.434362 2.028826
H  1.874961 -0.597386 -1.593345
H  0.614282 -1.864098 -1.456318
H  0.461303 -3.143321 0.77919
H  1.60375 -2.651847 2.076753
H  3.672768 -2.303619 -1.535822
H  2.500052 -2.721519 -2.819118
H  2.244236 -4.841399 0.980927
H  3.512142 -3.593899 0.788448
H  1.409956 -4.404694 -1.333547
H  3.154814 -4.753203 -1.407353
H  -1.423424 -1.849076 1.236768
H  3.894028 0.646297 0.86578
H  0.409656 3.889683 -0.834261
H  4.571672 2.947608 0.071298
H  2.851953 4.554515 -0.767996
H  -3.926422 -2.086555 0.943304
H  -4.091319 2.552989 -1.000854
H  -6.11423 -1.114053 0.217985
H  -6.209553 1.199668 -0.758034
