program: Gaussian 09
title: 000288913
version: EM64L-G09RevD.01
frameworkgroup: C1[X(C15H20BrNO)]
method: RPBEPBE
basis: SDD
operation: Freq
keyword: #p
keyword: freq=noraman
keyword: PBEPBE/SDD
title: #p freq=noraman PBEPBE/SDD
converged: YES YES NO NO
title: Mulliken charges:
elementType: Br O N C C C C C C C C C C C C C C C H H H H H H H H H H H H H H H H H H H H
charge: -0.125791 -0.370879 -0.183946 -0.029553 -0.254916 0.015695 -0.440904 -0.446142 -0.469497 0.400306 -0.398093 -0.395803 -0.387117 -0.407947 -0.390553 -0.233853 -0.233410 -0.241190 0.278666 0.235821 0.164673 0.210304 0.226557 0.207453 0.207842 0.304607 0.205164 0.189456 0.190404 0.202695 0.198977 0.192534 0.275960 0.233943 0.386424 0.227368 0.225912 0.228832
chargesum: 0.00000
title: Mulliken charges with hydrogens summed into heavy atoms:
elementType: Br O N C C C C C C C C C C C C C C C
charge: -0.125791 0.015545 -0.183946 0.249113 -0.019095 0.180368 -0.004042 -0.030847 -0.164890 0.400306 -0.003474 -0.002704 0.004394 -0.131987 -0.156610 -0.006486 -0.007498 -0.012357
polarizability: 2.33460614e+02 2.53106151e+01 1.74200121e+02 5.62037736e+00 5.54314608e+00 1.53966590e+02
1716.lowfreq: -8.0802 -0.0006 -0.0006 -0.0005 2.7728 11.5751 27.8860 36.6070 41.4870
frequency: 27.8284 36.5485 41.4853 50.3087 60.8966 74.2145 117.3520 142.4813 179.6089 214.5473 230.6040 246.5753 263.5695 308.5994 311.3964 355.5455 375.9691 407.0677 430.7285 446.8511 451.7043 477.7870 496.4415 532.8628 552.7259 594.9398 616.4865 658.6603 709.3132 738.9021 780.8250 788.8620 793.9577 817.6658 850.8685 863.9880 880.1922 884.4561 904.2528 928.0180 932.2732 946.0999 983.9158 987.1543 989.8858 1004.9206 1025.5678 1026.5921 1049.8941 1054.2313 1065.4640 1071.5582 1076.0219 1084.0053 1090.6646 1114.4623 1148.1021 1164.9035 1171.1998 1180.7247 1184.4892 1194.9039 1226.8407 1242.2411 1254.2498 1255.0790 1261.7586 1304.6963 1304.9974 1311.8884 1320.2818 1332.5609 1338.9351 1339.8948 1341.5078 1360.9081 1373.8672 1391.5824 1432.0620 1442.1332 1461.4443 1463.2757 1465.0258 1471.2398 1478.8912 1485.9355 1590.2355 1615.3702 2838.8333 2965.6775 2966.7908 2970.1408 2978.8917 2988.4908 3029.6228 3031.3152 3032.6727 3037.5055 3044.0566 3053.8751 3077.2851 3086.2573 3118.1600 3126.3570 3139.0997 3150.3286 3163.4870 3562.7072
redmass: 4.8533 3.7812 5.4562 4.9012 4.9501 4.1317 5.7083 3.4084 5.1149 3.6385 2.0825 4.2487 4.2243 2.4524 3.9750 3.5568 2.3574 2.8934 2.5820 1.8661 2.0876 1.9413 2.9608 3.9831 3.4998 4.0488 6.3776 4.4537 1.9614 2.5754 2.1006 1.4512 2.2741 4.8126 2.0212 1.2555 2.3954 1.9171 1.6877 1.5079 2.4379 2.0993 2.3313 1.5618 3.8938 1.3327 2.0923 3.6521 1.7429 1.1080 1.8460 1.6333 1.6571 1.5652 1.4855 2.5991 2.0273 1.5391 1.0604 1.2512 1.5939 1.4902 1.3773 1.3827 1.2835 1.3235 1.2990 1.3143 1.2751 1.3531 1.3640 1.3884 1.5560 1.4729 1.5024 1.6508 2.6083 2.7675 2.0880 2.2125 1.0881 1.0895 1.0887 1.0843 1.0955 2.4990 6.1366 6.1097 1.0810 1.0643 1.0634 1.0618 1.0606 1.0614 1.0965 1.0960 1.0868 1.1004 1.1029 1.1029 1.0888 1.0880 1.0863 1.0871 1.0920 1.0955 1.1014 1.0660
irintensity: 0.3924 0.0888 0.2561 0.0852 0.5357 0.4944 0.4200 0.8114 0.9753 2.9382 1.0496 25.2926 4.3463 8.4080 12.3352 3.6005 14.3529 0.0758 14.3649 65.2203 58.9687 4.2307 23.3289 16.1860 49.6860 22.1445 0.2657 54.2779 35.7773 32.4389 27.0332 2.3769 20.2525 14.1445 14.5148 0.4468 5.4832 0.8917 5.5215 7.1962 0.1319 1.3835 9.8830 0.2859 0.3574 2.1576 6.2507 87.6800 0.8304 1.4434 38.4138 33.4363 98.6772 59.5292 13.0109 0.1363 7.5440 18.0781 0.7065 3.5409 8.9475 6.4415 16.0354 1.7797 1.1349 13.9645 5.1047 1.5319 7.9849 2.8007 8.1576 0.6726 1.7886 6.1848 9.8836 34.6285 4.5106 5.3094 17.4788 12.3291 5.1721 6.2000 9.1637 20.6021 2.1349 18.2715 1.2341 13.5678 58.2913 33.1624 43.3774 36.1305 25.6680 19.4667 61.1535 75.0876 19.8876 3.2125 45.6802 73.3345 1.4767 17.9159 6.0593 0.9437 20.4267 25.5140 27.3169 27.3311
temp: 298.150 k
press: 1.00000 atm
elementType: 35 8 7 6 6 6 6 6 6 6 6 6 6 6 6 6 6 6 1 1 1 1 1 1 1 1 1 1 1 1 1 1 1 1 1 1 1 1
symmnumber: 1
zpe: 833920.2 jmol-1
zpe.correction: 0.317623 hartree
zpe.thermalcorrener: 0.335108 hartree
zpe.thermalcorrenthalpy: 0.336053 hartree
zpe.thermalcorrgfe: 0.269717 hartree
zpe.sumelectzpe: -725.630834 hartree
zpe.sumelectthermal: -725.613349 hartree
zpe.sumelectthermalent: -725.612405 hartree
zpe.sumelectthermalfe: -725.678741 hartree
dipole: -1.2208 -2.0064 -0.7890
dipole: 2.4776
quadrupole: -105.5442 -123.0969 -114.3716
quadrupole: -6.2124 -2.2292 1.3772
quadrupole: 8.7934 -8.7593 -0.0340 -6.2124 -2.2292 1.3772
hfenergy: -725.9484574 hartree
pointgroup: C01 [X(C15H20Br1N1O1)]
dipole: -0.3753886 -0.6801569 -0.5887781 debye
polarizability: 226.0946463|28.1407435|173.9808033|15.9516201|13.8077385|161.5518759 unknown
InChI: InChI=1S/C15H20BrNO/c16-15(18)14-13(11-7-3-1-4-8-11)17(14)12-9-5-2-6-10-12/h1,3-4,7-8,12-15,18H,2,5-6,9-10H2
charge 0 multiplicity 1
38 atoms
Br 0.321298 3.443665 1.878588
O  -1.804394 3.038365 -0.082062
N  0.621579 0.225241 0.175947
C  -0.047897 1.466389 -0.311456
C  -0.482658 0.072115 -0.828029
C  2.014386 -0.025857 -0.310919
C  3.021191 0.753748 0.560586
C  2.295077 -1.543596 -0.264523
C  -0.90971 2.223507 0.650191
C  -1.75113 -0.618149 -0.427455
C  4.47595 0.44936 0.129345
C  3.748804 -1.854674 -0.695084
C  4.768208 -1.070284 0.166231
C  -1.918929 -1.162358 0.87138
C  -2.810365 -0.731353 -1.36514
C  -3.125246 -1.807299 1.225045
C  -4.016925 -1.37293 -1.010326
C  -4.179243 -1.912987 0.287467
H  0.481264 2.10046 -1.03839
H  -0.17824 -0.099559 -1.874249
H  2.124367 0.321184 -1.372456
H  2.870762 0.45587 1.616941
H  2.814086 1.838921 0.502868
H  1.57369 -2.083625 -0.908491
H  2.129019 -1.893706 0.773574
H  -1.378593 1.58771 1.417865
H  5.180623 0.993166 0.78687
H  4.644436 0.827748 -0.900707
H  3.886034 -1.580163 -1.761931
H  3.936424 -2.942914 -0.619856
H  5.799123 -1.271097 -0.184059
H  4.708235 -1.426187 1.215304
H  -1.086275 -1.086221 1.579325
H  -2.690055 -0.311163 -2.371446
H  -2.425613 3.51511 0.525463
H  -3.241304 -2.231833 2.228806
H  -4.827847 -1.453355 -1.743112
H  -5.114232 -2.414252 0.561894
