program: Gaussian 09
title: 000288910
version: EM64L-G09RevD.01
frameworkgroup: C1[X(C15H11Br3O)]
method: RPBEPBE
basis: SDD
operation: Freq
keyword: #p
keyword: freq=noraman
keyword: PBEPBE/SDD
title: #p freq=noraman PBEPBE/SDD
converged: YES YES NO NO
title: Mulliken charges:
elementType: Br Br Br O C C C C C C C C C C C C C C C H H H H H H H H H H H
charge: 0.018249 0.068264 0.018202 -0.182552 -0.671210 -0.569891 0.580966 0.186425 0.418104 -0.391164 -0.334745 -0.376550 -0.311594 -0.220102 -0.223503 -0.239380 -0.180417 -0.228335 -0.221093 0.339253 0.331261 0.238235 0.240599 0.274896 0.231689 0.229415 0.232138 0.255341 0.243493 0.244008
chargesum: 0.00000
title: Mulliken charges with hydrogens summed into heavy atoms:
elementType: Br Br Br O C C C C C C C C C C C C C C C
charge: 0.018249 0.068264 0.018202 -0.182552 -0.331957 -0.238630 0.580966 0.186425 0.418104 -0.152929 -0.094146 -0.376550 -0.036698 0.011587 0.005912 -0.007242 0.074923 0.015158 0.022915
polarizability: 2.30797334e+02 -1.33584177e+01 2.15896278e+02 5.91203073e+00 -2.83829866e+00 1.95749015e+02
1716.lowfreq: -5.2767 -5.0194 -0.0004 -0.0003 0.0002 2.1983 11.4062 24.6307 28.0316
frequency: 10.9716 24.6137 27.9768 49.0129 63.7787 69.0981 104.4410 108.2310 127.1266 143.8905 157.3684 197.9319 208.0204 233.9965 243.9128 273.9647 332.8968 400.3204 409.8131 414.8160 466.6692 477.7189 533.4223 535.9564 585.5964 614.6993 621.1573 634.4756 688.0121 696.1460 700.7161 744.7188 772.1370 784.9825 809.0695 823.2105 847.4108 878.8920 926.6562 958.1527 966.7113 976.4219 991.0313 997.0946 998.4159 1003.3637 1026.3098 1048.9503 1069.9941 1091.5786 1117.4800 1131.9602 1158.9809 1174.7036 1177.9684 1191.9695 1198.0585 1215.8826 1254.0270 1270.1172 1314.1101 1348.7971 1363.0658 1387.4970 1413.0882 1443.0350 1449.7313 1481.0615 1554.0806 1570.6871 1591.6929 1595.9674 1608.5771 3108.0809 3127.5780 3128.8204 3134.0258 3143.4467 3144.3745 3153.9764 3155.6432 3168.2738 3168.3854 3179.1256
redmass: 8.9791 6.2306 20.5267 4.9693 6.8169 13.2909 25.5922 5.0437 16.4808 7.4931 9.2554 7.0850 8.1126 5.7429 6.1231 8.5995 8.6094 2.7918 5.5287 3.9195 4.1555 4.6229 5.0477 5.0358 5.8655 6.1527 6.0471 6.3027 5.8237 2.6014 2.3172 1.9956 1.9401 2.0955 4.6629 4.3611 1.2549 1.4165 1.4673 3.9640 1.5164 1.4326 5.6523 1.3814 1.3326 6.6810 2.3167 2.5288 2.1157 1.8341 1.7919 1.2164 1.2079 1.0671 1.0608 1.1510 1.5897 2.5869 1.6747 1.6975 1.4401 1.3328 7.4391 6.3812 2.2000 2.1495 2.3199 2.2504 7.0972 7.9585 5.9647 6.6821 6.0195 1.0869 1.0850 1.0858 1.0876 1.0862 1.0924 1.0968 1.0903 1.0951 1.1017 1.1007
irintensity: 0.3325 1.2423 0.0127 0.3110 0.3069 0.3945 0.5085 0.9396 2.2143 1.6916 0.2374 3.7201 0.5633 1.1136 0.5469 1.3206 19.2486 0.6497 8.4597 4.0027 13.1745 6.8457 9.1155 43.0247 79.7606 2.9388 14.3802 14.6314 14.1522 12.8811 81.9891 36.9746 17.5653 46.3544 1.9538 1.3956 0.8122 1.1050 0.1982 19.6772 6.3693 1.0220 1.5411 0.8450 0.1604 45.8952 3.3512 2.7781 5.7787 6.3033 3.1064 25.0573 8.2160 0.2231 0.4748 2.0684 16.0210 28.1081 56.2130 85.8304 46.0194 8.5491 5.8745 0.5173 47.3791 11.4558 17.1048 5.4463 67.6883 100.1984 0.4865 26.3133 1.1122 0.4996 2.5787 4.5336 0.9407 1.9560 16.9016 27.0597 3.7216 5.1070 20.6027 15.5091
temp: 298.150 k
press: 1.00000 atm
elementType: 35 35 35 8 6 6 6 6 6 6 6 6 6 6 6 6 6 6 6 1 1 1 1 1 1 1 1 1 1 1
symmnumber: 1
zpe: 559231.0 jmol-1
zpe.correction: 0.213000 hartree
zpe.thermalcorrener: 0.231310 hartree
zpe.thermalcorrenthalpy: 0.232255 hartree
zpe.thermalcorrgfe: 0.161045 hartree
zpe.sumelectzpe: -692.451300 hartree
zpe.sumelectthermal: -692.432989 hartree
zpe.sumelectthermalent: -692.432045 hartree
zpe.sumelectthermalfe: -692.503255 hartree
dipole: 3.5975 2.5921 0.5301
dipole: 4.4656
quadrupole: -120.6477 -136.4695 -134.2896
quadrupole: -6.6155 -0.9645 -3.6748
quadrupole: 9.8212 -6.0005 -3.8207 -6.6155 -0.9645 -3.6748
hfenergy: -692.6642999 hartree
pointgroup: C01 [X(C15H11Br3O1)]
dipole: -1.2148092 1.2048198 -0.3992638 debye
polarizability: 235.598467|10.5633468|211.4438526|2.3582453|-2.0600936|195.4003065 unknown
InChI: InChI=1S/C15H11Br3O/c16-12-9-5-4-8-11(12)15(19)14(18)13(17)10-6-2-1-3-7-10/h1-9,13-14H
charge 0 multiplicity 1
30 atoms
Br 2.761421 -2.291643 2.074025
Br -0.656543 -3.034168 1.377801
Br -1.207146 1.45089 2.564129
O  -0.262371 -0.809263 -1.353189
C  1.701741 -1.401014 0.548072
C  0.237862 -1.230056 0.980408
C  2.365558 -0.092471 0.173312
C  -0.642998 -0.671278 -0.157056
C  -2.014788 -0.103116 0.12596
C  2.944492 0.037655 -1.114403
C  2.414609 1.007875 1.06837
C  -2.435971 0.721275 1.203429
C  -3.000238 -0.449881 -0.8477
C  3.558348 1.247866 -1.503465
C  3.026091 2.217519 0.678397
C  3.59944 2.342232 -0.609117
C  -3.774632 1.152293 1.325654
C  -4.337826 -0.034747 -0.735655
C  -4.730469 0.763766 0.362648
H  1.774028 -2.130928 -0.270574
H  0.133037 -0.687378 1.928206
H  2.899293 -0.803935 -1.814344
H  2.004553 0.909312 2.079675
H  -2.671883 -1.064242 -1.692068
H  4.000591 1.336884 -2.501641
H  3.061304 3.059709 1.378168
H  4.076845 3.281335 -0.909944
H  -4.063745 1.795324 2.161563
H  -5.068026 -0.331795 -1.494744
H  -5.768277 1.095783 0.470385
