program: Gaussian 09
title: 000288942
version: EM64L-G09RevD.01
frameworkgroup: C1[X(C20H21NO2)]
method: RPBEPBE
basis: SDD
operation: Freq
keyword: #p
keyword: freq=noraman
keyword: PBEPBE/SDD
title: #p freq=noraman PBEPBE/SDD
converged: YES YES NO NO
title: Mulliken charges:
elementType: O O N C C C C C C C C C C C C C C C C C C C C H H H H H H H H H H H H H H H H H H H H H
charge: -0.248755 -0.232203 -0.107987 -0.339136 -0.345169 -0.548616 -0.318427 -0.323363 0.318717 0.045329 -0.454257 0.309528 0.424540 -0.361161 -0.376498 -0.393724 -0.400066 -0.239549 -0.231476 -0.243871 -0.237857 -0.231228 -0.239073 0.198798 0.210503 0.231657 0.191967 0.229669 0.244806 0.192105 0.212214 0.212716 0.200140 0.249443 0.254537 0.270538 0.251566 0.236724 0.229865 0.232301 0.230337 0.229380 0.232265 0.232778
chargesum: 0.00000
title: Mulliken charges with hydrogens summed into heavy atoms:
elementType: O O N C C C C C C C C C C C C C C C C C C C C
charge: -0.248755 -0.232203 -0.107987 0.070165 0.078454 -0.074140 0.085891 0.089492 0.318717 0.045329 -0.204815 0.309528 0.424540 -0.106625 -0.105961 -0.142158 -0.163342 -0.009685 0.000825 -0.013534 -0.008477 0.001037 -0.006296
polarizability: 3.03475605e+02 1.64638878e+01 2.19100152e+02 1.86510741e+01 -3.44304258e+01 1.97880199e+02
1716.lowfreq: -11.2213 -0.0009 -0.0006 0.0006 1.6578 7.4962 15.7944 23.7524 30.7422
frequency: 14.3292 23.6560 30.3027 38.3758 47.8064 58.6102 86.6254 92.9705 131.0137 139.5694 172.8393 197.5860 225.5298 247.1486 273.4511 308.5003 326.2772 356.2577 372.7739 392.2612 402.6544 405.4937 409.7812 421.2825 470.1286 494.6493 519.7626 545.6366 591.3334 606.2385 614.2804 615.2607 651.2798 694.1537 702.9103 706.1202 727.2278 760.8029 769.1110 798.5837 809.6331 826.8789 843.6169 853.0595 860.9531 884.7643 898.2290 925.5568 941.5511 946.2892 976.8511 979.8909 987.1484 988.4221 989.5739 996.5996 997.9812 1003.7972 1025.9846 1027.3169 1028.0579 1052.1492 1079.9099 1081.0225 1083.5196 1095.9045 1123.6083 1130.6552 1162.6972 1173.4906 1174.0044 1184.9538 1191.4099 1192.4692 1218.9829 1233.2173 1264.3403 1272.0207 1293.6217 1300.1439 1315.2482 1318.7992 1329.3634 1337.3266 1355.7993 1362.6143 1371.2994 1374.7184 1383.4664 1391.1759 1432.9556 1436.7730 1444.0947 1448.2186 1451.5480 1454.6350 1463.8104 1476.1325 1481.0640 1534.4811 1578.7286 1587.3422 1607.2165 1608.6852 1627.0033 2862.6417 2871.6494 2951.0304 2959.3071 2964.5642 3021.1265 3040.0713 3045.7925 3078.9462 3085.8001 3089.3944 3120.2740 3126.2404 3130.3304 3136.1412 3143.2910 3147.7736 3156.4225 3156.8873 3167.8216 3168.8187
redmass: 5.2007 5.7208 3.1605 4.2959 3.9450 4.7781 4.9547 4.7243 5.1551 4.4721 5.1372 4.7087 3.9461 1.9594 3.4482 6.1036 3.0855 2.2795 5.0677 2.0676 4.1561 2.9562 3.0245 4.4253 2.7546 3.5315 4.8463 3.7961 3.1818 3.0448 6.3321 6.3880 5.0623 3.5899 1.8971 1.5482 3.9267 1.8535 2.8359 3.2182 3.5259 4.2889 1.5898 1.2575 1.2511 2.4692 1.6420 1.9748 1.5426 1.8487 1.4571 2.4509 1.4011 4.4970 6.0609 1.6041 1.9981 1.3373 2.1978 2.1548 2.1357 2.0474 2.5867 1.9455 1.6315 2.2238 2.5214 2.4364 2.5513 1.0562 1.0586 1.1282 1.0746 1.1212 1.4400 1.8510 2.8222 1.3523 1.2864 1.4898 1.3522 1.3636 1.4662 1.2314 1.3815 1.9444 1.2623 1.9153 8.4532 2.4457 2.2585 2.1970 1.0842 1.0834 1.0874 1.0943 1.1084 2.2518 2.2485 9.8879 5.7675 6.2632 6.0470 6.0154 7.8562 1.0702 1.0693 1.0667 1.0639 1.0660 1.0890 1.0915 1.0949 1.0964 1.0983 1.0874 1.0868 1.0849 1.0868 1.0880 1.0926 1.0925 1.0954 1.0961 1.1011 1.1006
irintensity: 0.1428 1.3076 0.0405 0.1903 0.1886 1.1846 0.8531 2.3423 0.4724 1.6599 2.5479 2.2193 2.1866 1.6129 12.1352 1.8310 1.8090 20.8660 1.9175 2.0107 3.1724 0.1279 3.1444 3.9876 1.1076 31.8817 5.7422 5.9214 22.4792 6.4090 0.3661 0.9889 16.5435 0.8245 84.1558 30.8714 9.5748 74.3921 20.7793 10.9482 12.7191 4.1493 0.1378 0.1800 1.8145 10.1839 7.2073 16.8633 10.9902 16.2600 0.1258 50.8965 3.6594 0.1284 2.3778 15.3259 21.4240 0.9470 15.7690 2.2133 5.9230 19.8110 44.8851 11.7389 11.4269 14.6035 11.9919 42.5681 16.3893 0.0834 0.3275 19.6596 3.3008 0.3463 9.4686 39.7344 179.2673 28.8950 5.6335 30.1746 1.6542 15.0489 39.8452 9.2724 2.1027 13.4138 3.0742 8.6667 1.6684 2.7996 11.9885 18.7948 2.6047 2.9315 13.1183 17.0993 17.8233 1.5554 10.5900 141.2885 1.6512 5.4963 12.6999 3.2969 20.7088 44.7270 148.0990 49.5922 43.9939 76.6782 34.1215 13.9683 13.8909 37.5802 47.5994 11.9434 6.6864 0.2786 0.1960 5.3288 21.2991 19.6540 34.1747 22.6229 26.2540 14.7988
temp: 298.150 k
press: 1.00000 atm
elementType: 8 8 7 6 6 6 6 6 6 6 6 6 6 6 6 6 6 6 6 6 6 6 6 1 1 1 1 1 1 1 1 1 1 1 1 1 1 1 1 1 1 1 1 1
symmnumber: 1
zpe: 945885.3 jmol-1
zpe.correction: 0.360269 hartree
zpe.thermalcorrener: 0.380650 hartree
zpe.thermalcorrenthalpy: 0.381594 hartree
zpe.thermalcorrgfe: 0.307833 hartree
zpe.sumelectzpe: -978.220227 hartree
zpe.sumelectthermal: -978.199845 hartree
zpe.sumelectthermalent: -978.198901 hartree
zpe.sumelectthermalfe: -978.272662 hartree
dipole: 2.3553 -2.4668 1.6540
dipole: 3.7906
quadrupole: -123.7340 -138.2733 -133.6850
quadrupole: 10.7092 -0.8656 -12.9373
quadrupole: 8.1634 -6.3758 -1.7875 10.7092 -0.8656 -12.9373
hfenergy: -978.5804952 hartree
pointgroup: C01 [X(C20H21N1O2)]
dipole: 0.17514 -1.2720759 -0.758417 debye
polarizability: 261.2296619|49.4402616|253.397071|-18.6628337|35.1118417|205.8292238 unknown
InChI: InChI=1S/C20H21NO2/c22-20(18-9-5-2-6-10-18)19(15-17-7-3-1-4-8-17)16-21-11-13-23-14-12-21/h1-10,15H,11-14,16H2
charge 0 multiplicity 1
44 atoms
O  -2.660334 3.834293 -0.780438
O  1.167932 1.207065 2.295085
N  -1.502554 1.565365 0.57669
C  -2.185975 1.39895 -0.724864
C  -2.038326 2.708494 1.34844
C  -1.34744 0.299673 1.33798
C  -2.091696 2.704028 -1.533308
C  -1.943242 3.987334 0.49934
C  -0.034391 -0.336196 0.905063
C  1.159332 0.531853 1.216026
C  0.143629 -1.56637 0.319087
C  2.34751 0.5825 0.293882
C  -0.845596 -2.641535 0.093538
C  2.221432 0.423248 -1.11213
C  3.620731 0.884661 0.846598
C  -1.918226 -2.924123 0.989326
C  -0.692093 -3.477358 -1.051565
C  3.352198 0.555525 -1.947493
C  4.751673 0.999777 0.013981
C  -2.824847 -3.97241 0.722921
C  -1.603529 -4.518007 -1.322649
C  4.620319 0.834746 -1.386687
C  -2.680395 -4.766344 -0.438445
H  -3.263916 1.129212 -0.589008
H  -1.701848 0.577085 -1.286807
H  -1.431106 2.830769 2.264144
H  -3.104459 2.547152 1.64757
H  -2.21149 -0.37823 1.181768
H  -1.290251 0.543308 2.414592
H  -1.026734 2.913391 -1.775265
H  -2.681059 2.642322 -2.46336
H  -2.423774 4.840868 1.005213
H  -0.874466 4.218111 0.302605
H  1.158436 -1.805533 -0.031569
H  1.235352 0.231191 -1.54845
H  3.695297 1.033217 1.929037
H  -2.007702 -2.359593 1.922605
H  0.14576 -3.294389 -1.735769
H  3.245351 0.448338 -3.032707
H  5.731972 1.222322 0.449514
H  -3.635976 -4.179908 1.429742
H  -1.472303 -5.139732 -2.215222
H  5.498072 0.931545 -2.035612
H  -3.385269 -5.579811 -0.642502
