program: Gaussian 09
title: 000288940
version: EM64L-G09RevD.01
frameworkgroup: C1[X(C20H23NO2)]
method: RPBEPBE
basis: SDD
operation: Freq
keyword: #p
keyword: freq=noraman
keyword: PBEPBE/SDD
title: #p freq=noraman PBEPBE/SDD
converged: NO YES NO NO
title: Mulliken charges:
elementType: O O N C C C C C C C C C C C C C C C C C C C C H H H H H H H H H H H H H H H H H H H H H H H
charge: -0.240419 -0.196948 -0.142516 -0.195754 -0.242399 -0.346020 -0.350983 0.441557 -0.333940 -0.337278 -0.755066 0.101796 -0.442482 -0.358911 0.299215 -0.224882 -0.246541 -0.242756 -0.363131 -0.353790 -0.252966 -0.235031 -0.228717 0.241333 0.229179 0.242494 0.195612 0.191452 0.223591 0.216321 0.193443 0.190449 0.214607 0.269832 0.220117 0.225863 0.238993 0.263843 0.224766 0.224436 0.227112 0.234152 0.280343 0.231557 0.234089 0.234378
chargesum: 0.00000
title: Mulliken charges with hydrogens summed into heavy atoms:
elementType: O O N C C C C C C C C C C C C C C C C C C C C
charge: -0.240419 -0.196948 -0.142516 0.045578 -0.013220 0.092086 0.064061 0.441557 0.075824 0.067778 -0.039254 0.101796 -0.203488 -0.095068 0.299215 -0.000115 -0.022105 -0.015644 -0.128979 -0.073447 -0.021410 -0.000942 0.005661
polarizability: 2.46756969e+02 5.66928584e-01 2.39492769e+02 3.35137446e+01 1.14368850e+01 1.76152979e+02
1716.lowfreq: -4.4417 0.0005 0.0007 0.0008 3.0417 9.0346 20.6121 32.9730 48.4016
frequency: 20.0632 32.7067 48.3310 50.1510 63.6560 70.7028 106.0046 109.3586 142.5787 160.8420 190.1718 195.8674 205.6136 235.5443 255.6740 265.6590 303.1733 313.2185 331.7610 346.1304 400.1091 404.9498 408.0509 411.7402 445.9922 466.8492 470.3533 513.1201 546.5428 599.7860 614.4400 617.4164 635.9725 646.5420 692.7506 702.4205 711.7369 741.1932 764.3622 785.9933 798.0712 811.7992 836.1192 845.3645 857.6951 860.6299 870.8995 922.0140 933.4653 941.3644 963.8258 983.7169 988.0735 989.5267 990.8501 996.4170 1001.9566 1009.3280 1026.2653 1026.7417 1027.7868 1042.1088 1053.7981 1074.9468 1077.7925 1084.9342 1089.6337 1103.4597 1112.7536 1119.9008 1151.1511 1171.1032 1173.6261 1184.9841 1187.1301 1190.5622 1193.5387 1219.7635 1243.0422 1255.8657 1266.9078 1291.2382 1300.1906 1307.4553 1320.1011 1336.1675 1342.3193 1348.0261 1354.3565 1373.7823 1378.1953 1385.1162 1389.0090 1392.4937 1434.7136 1442.1925 1444.1547 1450.0590 1452.6294 1462.7995 1466.9112 1476.1208 1481.7702 1483.4102 1568.8022 1593.4446 1595.6127 1610.5932 1613.5875 2845.4806 2851.7558 2872.0888 2950.7086 2956.2999 2983.9783 3000.3775 3046.5315 3060.3621 3078.5912 3084.0948 3091.9983 3111.1921 3115.0482 3124.2101 3128.1431 3137.2398 3137.7199 3148.7067 3150.3377 3158.0518 3162.9413 3168.8494
redmass: 5.3451 4.6182 3.7636 4.1883 4.9697 3.3519 4.6598 6.0200 4.0386 4.1086 2.4596 2.0880 1.9674 2.2570 3.2924 3.1913 3.9773 2.8375 3.6990 5.6521 2.8003 2.0142 3.2677 3.2245 3.9867 3.5254 4.1813 4.2238 3.6638 2.6809 6.4036 5.9681 3.4700 4.4209 3.3102 1.8107 1.5588 3.4668 2.1048 2.6190 3.5921 3.5213 3.1777 1.6002 1.2588 1.2733 2.7210 2.1882 1.6384 1.4358 3.4634 1.4112 1.3845 6.1821 5.5931 1.6181 2.0719 1.3531 2.1959 2.2255 2.0709 1.6471 1.9839 1.6245 1.7147 3.5348 1.7195 2.2153 2.7165 2.8207 4.0387 1.0668 1.0619 1.3007 1.2044 1.5974 1.1240 2.0356 1.6195 1.2793 1.2692 1.2501 1.2599 1.5094 1.2789 1.2822 1.3298 1.3465 1.5300 1.4478 1.5362 8.7606 2.0857 1.4905 2.2502 2.0537 1.0842 1.0790 1.1004 1.0811 1.0811 2.1750 2.1528 1.0869 7.1262 6.0589 6.7293 6.5692 6.1659 1.0766 1.0741 1.0704 1.0668 1.0670 1.0793 1.0375 1.0874 1.0887 1.0959 1.0969 1.0997 1.0993 1.0869 1.0865 1.0849 1.0878 1.0918 1.0921 1.0951 1.0957 1.1011 1.1011
irintensity: 0.3511 0.6713 0.3369 0.6718 0.4988 0.5452 1.1569 2.4205 0.3403 0.2526 3.0082 0.3830 1.4328 1.7637 0.6227 0.9378 1.2308 6.9510 10.7304 2.4068 0.1912 0.5214 0.5208 0.8866 1.3164 1.3130 2.6600 8.3945 13.8479 2.9583 0.0674 0.0837 1.2800 16.6238 4.7161 82.9637 28.3046 13.9603 65.2331 17.7019 9.7457 13.0942 22.2936 0.6648 1.1689 0.6279 0.2231 15.4081 17.3385 3.2533 65.0952 0.9603 1.6379 1.9098 0.2186 19.8251 32.1395 0.6987 10.1889 6.1172 1.3761 5.2063 17.7456 5.4011 17.1648 34.1666 27.6605 3.7790 17.7246 25.8310 12.1891 0.1918 1.7596 2.5449 14.3149 2.2676 1.4680 70.2020 81.2896 30.0758 10.5897 15.2147 8.6434 17.7094 5.8075 2.6364 15.4989 23.2535 6.0101 6.0753 0.9312 0.9930 11.5697 36.6867 16.1948 17.3951 2.3694 2.8840 14.2792 3.1155 9.1012 0.6619 14.3296 5.2015 73.3234 1.6572 32.7822 12.1855 4.5080 24.4634 90.4959 96.1970 42.8741 87.7032 35.7388 22.7190 35.8392 18.0072 39.3007 33.2648 26.6164 14.0621 8.5498 0.6612 0.8228 3.1360 25.7199 23.6884 27.1409 17.8444 23.4942 21.1478
temp: 298.150 k
press: 1.00000 atm
elementType: 8 8 7 6 6 6 6 6 6 6 6 6 6 6 6 6 6 6 6 6 6 6 6 1 1 1 1 1 1 1 1 1 1 1 1 1 1 1 1 1 1 1 1 1 1 1
symmnumber: 1
zpe: 1005858.5 jmol-1
zpe.correction: 0.383111 hartree
zpe.thermalcorrener: 0.403793 hartree
zpe.thermalcorrenthalpy: 0.404737 hartree
zpe.thermalcorrgfe: 0.332440 hartree
zpe.sumelectzpe: -979.405918 hartree
zpe.sumelectthermal: -979.385237 hartree
zpe.sumelectthermalent: -979.384293 hartree
zpe.sumelectthermalfe: -979.456590 hartree
dipole: -1.1122 -1.3223 -1.7377
dipole: 2.4505
quadrupole: -135.3382 -130.1648 -139.5603
quadrupole: 11.6345 14.7781 -6.3197
quadrupole: -0.3171 4.8563 -4.5392 11.6345 14.7781 -6.3197
hfenergy: -979.7890297 hartree
pointgroup: C01 [X(C20H23N1O2)]
dipole: 0.5373199 0.413899 -0.6851882 debye
polarizability: 244.4890544|-0.0825744|239.7837991|-37.3010393|-0.2059277|178.1298637 unknown
InChI: InChI=1S/C20H23NO2/c1-16(20(22)18-10-6-3-7-11-18)19(17-8-4-2-5-9-17)21-12-14-23-15-13-21/h2-11,16,19H,12-15H2,1H3
charge 0 multiplicity 1
46 atoms
O  -3.637551 3.38099 -0.540369
O  1.660548 -1.512348 1.939422
N  -1.838507 1.190651 0.203355
C  -0.615959 0.330487 0.106963
C  0.250405 0.417034 1.431839
C  -2.595159 1.194145 -1.084433
C  -1.567644 2.597327 0.606465
C  -0.993596 -1.117186 -0.22406
C  -3.900145 1.988243 -0.941399
C  -2.886575 3.380861 0.721919
C  -0.527665 0.031277 2.703486
C  1.524767 -0.438673 1.284562
C  -0.226617 -1.849355 -1.163413
C  -2.087599 -1.758903 0.411101
C  2.622739 0.011479 0.352127
C  -0.533614 -3.197737 -1.454886
C  -2.399142 -3.104283 0.119315
C  -1.621056 -3.831398 -0.81222
C  2.676554 1.30895 -0.226767
C  3.663216 -0.913063 0.060142
C  3.745432 1.670892 -1.075343
C  4.725675 -0.555186 -0.7920
C  4.770361 0.740139 -1.36332
H  0.039128 0.702783 -0.72213
H  0.585955 1.469941 1.518004
H  -2.829881 0.154836 -1.370509
H  -1.98118 1.644896 -1.904543
H  -0.8964 3.111797 -0.129016
H  -1.077336 2.621274 1.595355
H  -4.430026 2.053578 -1.905952
H  -4.555083 1.499359 -0.187962
H  -3.507196 2.931516 1.527865
H  -2.692907 4.441757 0.952296
H  -0.717468 -1.053355 2.724704
H  0.061133 0.278315 3.604693
H  -1.493068 0.563652 2.743724
H  0.614733 -1.362654 -1.67286
H  -2.699918 -1.185949 1.115409
H  0.071569 -3.749274 -2.183248
H  -3.247569 -3.586729 0.618154
H  -1.862244 -4.876486 -1.037085
H  1.901156 2.050015 -0.005365
H  3.61094 -1.904656 0.521961
H  3.781265 2.676227 -1.509059
H  5.519097 -1.278055 -1.011177
H  5.598133 1.022166 -2.023646
