program: Gaussian 09
title: 000288941
version: EM64L-G09RevD.01
frameworkgroup: C1[X(C21H25NO)]
method: RPBEPBE
basis: SDD
operation: Freq
keyword: #p
keyword: freq=noraman
keyword: PBEPBE/SDD
title: #p freq=noraman PBEPBE/SDD
converged: NO YES NO NO
title: Mulliken charges:
elementType: O N C C C C C C C C C C C C C C C C C C C C C H H H H H H H H H H H H H H H H H H H H H H H H H
charge: -0.197979 -0.124265 -0.187885 -0.365252 -0.367338 -0.406597 -0.409697 -0.243198 -0.400154 0.436605 -0.756539 0.100254 -0.443892 -0.357514 0.299684 -0.226124 -0.248122 -0.244071 -0.364335 -0.354803 -0.253605 -0.235683 -0.229646 0.236233 0.244865 0.172325 0.168377 0.224296 0.206733 0.194333 0.191881 0.204967 0.229201 0.189002 0.215526 0.268461 0.218123 0.229506 0.238327 0.263835 0.223184 0.222935 0.225468 0.235811 0.280253 0.230056 0.233198 0.233256
chargesum: 0.00000
title: Mulliken charges with hydrogens summed into heavy atoms:
elementType: O N C C C C C C C C C C C C C C C C C C C C C
charge: -0.197979 -0.124265 0.048348 0.051938 0.025335 -0.005531 -0.012849 -0.013997 0.004375 0.436605 -0.040448 0.100254 -0.205565 -0.093679 0.299684 -0.002940 -0.025187 -0.018603 -0.128524 -0.074550 -0.023549 -0.002485 0.003611
polarizability: 2.57844184e+02 -2.80258744e+00 2.46523257e+02 3.27719685e+01 1.37668432e+01 1.81252762e+02
1716.lowfreq: -8.1562 -4.5775 -0.0008 -0.0006 -0.0004 4.3069 18.5046 31.5110 46.0639
frequency: 17.7432 31.2410 45.9504 49.9572 63.9767 67.9624 104.6501 108.6023 143.4541 160.6367 186.4272 197.2090 207.4598 229.6517 257.5727 265.8200 299.2995 304.1384 329.6892 346.0579 393.6124 401.0061 408.1643 411.8947 441.2363 451.8221 461.4857 498.5358 545.3199 575.8718 614.3434 616.7152 633.0799 645.5087 692.5876 702.2086 711.3599 739.6664 763.6904 781.9553 795.7522 806.5291 819.7382 857.5385 859.5404 860.0942 865.7128 870.6449 926.1112 933.9104 941.1953 957.5404 964.8019 983.1272 987.2593 989.1396 989.5829 991.0816 998.1868 1008.7785 1026.4137 1027.3641 1041.8847 1045.8095 1071.9519 1072.3217 1079.7179 1088.2329 1106.9175 1116.5980 1121.2835 1144.9578 1153.6219 1170.4420 1173.1630 1183.4210 1186.3145 1189.6826 1217.6112 1219.7632 1241.5804 1258.6720 1271.7698 1287.5020 1299.5219 1307.0893 1319.8093 1333.3785 1339.8652 1344.3541 1349.8154 1354.1104 1360.2605 1379.5467 1384.8061 1388.6459 1392.8541 1434.2538 1442.1704 1451.7405 1459.7671 1462.9821 1467.2609 1468.8628 1475.9976 1478.8409 1481.2813 1485.9847 1568.4298 1593.2210 1595.3657 1610.4687 1613.4191 2805.6028 2827.6687 2842.8557 2967.9717 2983.6453 2985.6235 2988.0968 3000.2909 3033.7138 3043.1512 3048.7648 3053.4088 3065.5563 3091.8517 3111.2916 3113.8632 3123.0464 3127.2160 3136.5081 3136.8143 3148.4794 3149.4742 3157.6923 3161.9461 3168.3182
redmass: 4.9662 4.3053 3.3654 3.9556 4.6944 3.3591 3.8158 6.2732 3.8425 4.0502 2.8802 1.8751 1.7513 2.1536 3.3895 3.0660 2.4026 3.5540 3.7563 5.7585 1.8824 2.8224 3.2344 3.2949 3.4237 3.2477 3.2331 3.0175 3.6838 2.5556 6.4119 6.3222 4.0401 4.9448 3.4430 1.7749 1.5553 3.5311 2.1245 2.7146 3.1063 1.4888 2.8915 1.2779 1.4265 1.2770 2.7833 2.6267 1.9089 1.8314 1.4358 1.3162 3.2610 1.4271 1.5576 2.4900 4.6575 4.8860 1.3757 1.3454 2.2262 2.0555 1.6696 2.2431 1.6493 1.6792 1.5425 1.6524 2.1236 2.7814 2.6329 1.9703 1.4475 1.0687 1.0616 1.4293 1.1755 1.5349 1.9817 1.9057 1.7134 1.2612 1.1833 1.2787 1.3106 1.5119 1.2835 1.2890 1.3777 1.4957 1.4643 1.5519 1.4182 1.8806 8.7462 1.8015 1.5561 2.2496 2.1143 1.0893 1.0853 1.0679 1.0683 1.0942 2.1726 1.0868 2.2583 1.0708 7.1524 6.0728 6.7270 6.5407 6.1797 1.0716 1.0733 1.0773 1.0625 1.0615 1.0616 1.0773 1.0386 1.0962 1.1017 1.0879 1.1019 1.0876 1.0995 1.0994 1.0867 1.0866 1.0849 1.0917 1.0881 1.0921 1.0950 1.0956 1.1010 1.1010
irintensity: 0.3995 0.3708 0.0562 0.2800 0.6330 1.1137 0.1531 1.6852 0.3105 0.0362 0.8232 0.6877 0.6043 0.5100 0.5193 0.7626 1.8892 1.3055 4.6621 3.7264 2.8085 0.5609 0.5289 0.6588 1.1002 0.5416 0.0349 6.1121 10.2672 3.4088 0.0737 0.3528 1.0530 14.0940 4.1606 81.7711 30.2793 14.0633 69.9976 15.6360 13.0216 0.0419 0.4430 2.0646 5.6448 1.2852 7.0109 1.8867 1.4215 22.5714 2.9677 4.6065 55.4953 1.1865 9.8968 20.9993 3.7932 6.3835 2.0340 0.5303 4.2304 3.4642 9.2705 12.8143 26.2286 7.5950 10.5417 26.2437 9.2004 2.9804 6.5741 12.9682 9.3899 0.1209 1.8395 5.0523 13.2464 2.6588 57.2145 25.6598 81.7112 8.2064 10.0116 9.4588 11.4343 18.5250 5.4663 2.8389 13.3358 20.4170 7.7015 5.1044 6.9023 1.4544 0.8586 14.1946 31.1159 16.4770 13.5738 5.9581 14.1072 5.2958 6.9080 11.0040 0.6523 6.8569 11.3817 4.4756 72.3708 1.6166 31.4012 12.0073 5.4896 64.7375 46.4350 137.1778 38.8729 40.1911 29.3337 33.3322 21.9398 77.1322 42.3668 23.0914 78.9749 21.1806 27.3436 14.0396 8.6788 0.8529 0.5996 18.2710 12.9530 24.3710 27.7260 18.3602 24.7751 21.5294
temp: 298.150 k
press: 1.00000 atm
elementType: 8 7 6 6 6 6 6 6 6 6 6 6 6 6 6 6 6 6 6 6 6 6 6 1 1 1 1 1 1 1 1 1 1 1 1 1 1 1 1 1 1 1 1 1 1 1 1 1
symmnumber: 1
zpe: 1069029.5 jmol-1
zpe.correction: 0.407172 hartree
zpe.thermalcorrener: 0.428075 hartree
zpe.thermalcorrenthalpy: 0.429019 hartree
zpe.thermalcorrgfe: 0.356188 hartree
zpe.sumelectzpe: -943.506497 hartree
zpe.sumelectthermal: -943.485594 hartree
zpe.sumelectthermalent: -943.484649 hartree
zpe.sumelectthermalfe: -943.557481 hartree
dipole: 0.4741 -2.7847 -2.5795
dipole: 3.8253
quadrupole: -127.5786 -128.4990 -141.7561
quadrupole: 2.8814 10.8091 -1.7113
quadrupole: 5.0327 4.1122 -9.1449 2.8814 10.8091 -1.7113
hfenergy: -943.9136685 hartree
pointgroup: C01 [X(C21H25N1O1)]
dipole: 0.0880798 1.1278377 -0.9926059 debye
polarizability: 253.8166938|-4.6052513|248.9367527|-37.1521749|-2.9164697|182.8667565 unknown
InChI: InChI=1S/C21H25NO/c1-17(21(23)19-13-7-3-8-14-19)20(18-11-5-2-6-12-18)22-15-9-4-10-16-22/h2-3,5-8,11-14,17,20H,4,9-10,15-16H2,1H3
charge 0 multiplicity 1
48 atoms
O  1.666101 -1.494667 1.948365
N  -1.841149 1.185825 0.173234
C  -0.613908 0.330657 0.089061
C  -2.592486 1.160751 -1.118458
C  -1.571687 2.592206 0.578559
C  -3.932437 1.913876 -1.014006
C  -2.879548 3.398139 0.726399
C  0.251864 0.426039 1.416125
C  -3.705622 3.37623 -0.576305
C  -0.978365 -1.12446 -0.227275
C  -0.530237 0.051874 2.688684
C  1.5267 -0.429027 1.280802
C  -0.197873 -1.864465 -1.149141
C  -2.071543 -1.766369 0.409036
C  2.62722 0.014167 0.346964
C  -0.490688 -3.219917 -1.422256
C  -2.368888 -3.118746 0.135969
C  -1.577137 -3.853555 -0.777984
C  2.680773 1.306154 -0.243834
C  3.670444 -0.910949 0.067524
C  3.752698 1.662329 -1.091195
C  4.735735 -0.559086 -0.783654
C  4.780592 0.731078 -1.366503
H  0.044099 0.697879 -0.741021
H  -2.772088 0.110335 -1.399945
H  -1.975842 1.621727 -1.935991
H  -0.905289 3.104136 -0.168916
H  -1.0483 2.600943 1.549368
H  -4.575724 1.398908 -0.274282
H  -4.448334 1.870793 -1.992481
H  -2.631287 4.436641 1.019307
H  -3.474757 2.952573 1.547263
H  0.588111 1.479044 1.495178
H  -3.155139 3.918446 -1.373029
H  -4.670002 3.899707 -0.434984
H  -0.71953 -1.032627 2.719594
H  0.054644 0.308521 3.589844
H  -1.495875 0.58422 2.718349
H  0.642617 -1.377904 -1.66019
H  -2.695602 -1.186003 1.096825
H  0.125029 -3.77705 -2.137556
H  -3.217422 -3.600681 0.635276
H  -1.807223 -4.904237 -0.988302
H  1.902578 2.047104 -0.032396
H  3.617866 -1.898234 0.538468
H  3.788541 2.663845 -1.533827
H  5.531259 -1.282598 -0.993102
H  5.610712 1.008625 -2.025862
