program: Gaussian 09
title: 000288930
version: EM64L-G09RevD.01
frameworkgroup: C1[X(C23H23N3)]
method: RPBEPBE
basis: SDD
operation: Freq
keyword: #pfreq=noraman
keyword: PBEPBE/SDD
title: #p freq=noraman PBEPBE/SDD
converged: YES YES NO NO
title: Mulliken charges:
elementType: N N N C C C C C C C C C C C C C C C C C C C C C C C H H H H H H H H H H H H H H H H H H H H H H H
charge: -0.252982 -0.290091 -0.042948 -0.307073 -0.296836 0.003166 0.498576 0.406882 0.316430 -0.316812 -0.417951 -0.373599 -0.342293 -0.401045 -0.363798 -0.381301 -0.689358 -0.227201 -0.233067 -0.243852 -0.232776 -0.198161 -0.251634 -0.235479 -0.265854 -0.243476 0.242066 0.266654 0.269360 0.214827 0.177394 0.225328 0.256926 0.247354 0.272077 0.268783 0.260346 0.208531 0.215014 0.232686 0.225511 0.228154 0.229905 0.220543 0.221834 0.222410 0.224499 0.225520 0.226804
chargesum: 0.00000
title: Mulliken charges with hydrogens summed into heavy atoms:
elementType: N N N C C C C C C C C C C C C C C C C C C C C C C C
charge: -0.252982 -0.020730 -0.042948 -0.065007 -0.030181 0.003166 0.498576 0.406882 0.316430 0.075410 -0.192623 -0.116674 -0.094939 -0.128968 -0.095014 -0.120955 -0.033126 -0.001690 -0.004912 -0.013947 -0.012233 0.023674 -0.029224 -0.010980 -0.040334 -0.016672
polarizability: 4.17808191e+02 9.00547449e+00 2.85991626e+02 -2.57985919e+01 1.10043021e+01 2.02679881e+02
1716.lowfreq: -9.7241 -6.3368 -5.0759 -0.0005 -0.0001 0.0005 17.9278 32.7486 34.0095
frequency: 17.8540 32.7153 33.9424 37.3707 44.4906 52.3887 54.5465 69.9722 85.0979 117.0586 150.2912 169.8684 174.2012 221.6240 239.8057 242.4643 254.5607 274.2544 279.2510 284.5480 338.1840 401.5382 402.3201 403.3693 409.9397 414.6969 477.4217 490.8600 505.2963 517.8091 558.5388 579.3701 613.2790 614.2782 615.6462 635.6336 645.3766 666.4892 685.0505 692.9842 695.8894 704.8105 756.0528 764.2065 773.8761 807.6051 822.2884 829.8811 851.0438 854.7951 864.1714 872.6562 895.2996 913.9349 915.9652 926.4712 952.5183 966.1747 978.1446 979.6228 981.0527 986.0401 988.3076 989.3440 996.3716 997.1998 1005.9565 1013.3157 1025.6962 1031.7695 1034.4456 1052.9645 1071.8126 1084.2833 1087.0353 1105.8635 1111.5036 1149.5212 1155.0661 1169.2090 1170.9722 1172.8011 1185.1065 1187.1432 1189.2986 1197.0030 1214.2135 1249.5353 1253.7237 1282.4818 1302.5624 1313.1467 1321.6940 1326.7730 1338.0389 1364.8130 1379.0182 1383.1637 1386.2620 1389.6473 1391.9358 1435.7714 1441.5890 1448.1097 1450.9265 1473.1518 1480.2538 1481.8484 1482.3873 1492.5661 1496.1272 1528.6175 1579.5505 1585.5989 1593.0266 1610.7240 1611.8960 1614.5868 2851.5976 2981.9534 2993.9242 2995.5521 3008.0118 3074.6925 3094.9692 3106.9902 3123.1450 3125.2557 3126.8347 3133.2764 3133.9119 3137.1959 3148.3145 3149.9623 3153.6692 3159.1824 3164.4188 3165.3363 3167.7328 3182.6995 3460.0871
redmass: 4.6260 3.9292 4.3806 3.9835 4.3153 3.8236 3.3995 4.8695 1.7992 4.5317 4.3790 4.3694 3.4871 3.7564 4.9626 4.0691 1.6889 2.7964 4.0723 4.8938 5.3223 2.9695 3.2357 3.4374 2.9761 4.1655 4.9724 3.4478 3.4750 3.8602 3.4763 1.7177 6.3714 6.4379 6.3056 5.5111 3.2947 6.0236 6.5134 1.9798 1.7936 1.7802 1.7106 1.8482 1.8417 1.1158 4.2342 1.3184 1.2570 1.2858 5.3833 5.1486 1.4429 1.7287 1.7450 1.4975 3.2275 1.3831 1.4338 1.5530 4.5670 1.3018 4.1399 6.1860 1.3276 1.3298 4.3339 3.8173 2.1983 2.0515 2.1117 2.5096 2.2646 1.5930 1.6127 1.9769 2.0874 2.2995 2.5856 1.0523 1.0561 1.0531 1.1611 1.1316 1.1267 1.9544 1.7114 1.3749 1.2901 1.6078 2.5133 1.2119 1.3908 1.4502 1.3312 1.3726 5.5309 6.7874 7.3296 2.4521 1.5208 2.3998 2.1721 2.4465 1.2167 1.0795 1.1172 2.2426 2.1944 2.8664 1.1065 6.5890 6.0789 6.5465 6.0797 5.9446 6.0894 6.0577 1.0715 1.0376 1.0855 1.0859 1.0851 1.0984 1.1004 1.0880 1.0847 1.0847 1.0858 1.0887 1.0895 1.0910 1.0956 1.0931 1.0933 1.0953 1.1013 1.0984 1.1005 1.0953 1.0752
irintensity: 0.0395 0.0567 0.1773 0.2260 0.1336 0.2202 0.2666 0.0219 1.5174 0.3476 2.7682 0.2596 0.7210 0.9414 2.1346 0.9100 1.4878 1.7493 1.0066 0.1307 1.9169 0.0590 1.6081 0.1672 0.0366 4.5603 8.4388 19.2860 5.5678 2.0997 1.9881 101.9145 0.3046 0.3709 0.1281 5.6041 5.3936 8.0065 16.3977 33.1785 48.8154 43.6020 73.4279 36.2077 63.2945 6.0826 0.9228 0.0413 0.1188 0.8272 19.5516 4.0830 7.9283 13.9005 1.4959 6.3898 46.2041 0.0464 0.2207 0.9893 10.1710 1.2179 0.9108 0.1409 0.2814 0.2920 3.7015 8.7100 10.1831 16.0987 4.7047 3.1993 90.5450 4.2291 5.2916 17.4099 158.9495 59.1380 29.7005 0.1018 0.1554 0.0885 9.9932 1.0324 1.5657 9.5979 22.0326 29.0935 5.1717 17.7677 19.0959 12.4910 4.3795 32.8116 9.8722 6.9299 30.6568 18.3617 9.9320 117.7852 37.4219 16.4125 12.1382 12.2982 21.8814 21.8920 6.3604 21.9511 35.9482 301.4256 9.8571 67.0448 10.0757 1.7861 1.3702 57.8781 37.3505 143.2973 90.8502 32.3622 16.0209 25.8366 16.8665 44.0813 28.8283 11.6261 3.0066 6.1682 0.3924 13.2234 15.2158 13.3546 31.7485 28.1530 39.9009 18.7763 26.3606 25.1413 23.9789 3.6158 2.2122
temp: 298.150 k
press: 1.00000 atm
elementType: 7 7 7 6 6 6 6 6 6 6 6 6 6 6 6 6 6 6 6 6 6 6 6 6 6 6 1 1 1 1 1 1 1 1 1 1 1 1 1 1 1 1 1 1 1 1 1 1 1
symmnumber: 1
zpe: 1053379.7 jmol-1
zpe.correction: 0.401211 hartree
zpe.thermalcorrener: 0.424052 hartree
zpe.thermalcorrenthalpy: 0.424996 hartree
zpe.thermalcorrgfe: 0.346182 hartree
zpe.sumelectzpe: -1052.641999 hartree
zpe.sumelectthermal: -1052.619158 hartree
zpe.sumelectthermalent: -1052.618214 hartree
zpe.sumelectthermalfe: -1052.697028 hartree
dipole: -0.1559 2.8970 0.9917
dipole: 3.0660
quadrupole: -148.8754 -140.9767 -148.3000
quadrupole: -3.4405 -0.1951 5.4577
quadrupole: -2.8247 5.0740 -2.2493 -3.4405 -0.1951 5.4577
hfenergy: -1053.0432098 hartree
pointgroup: C01 [X(C23H23N3)]
dipole: 0.0508752 1.1289592 -0.4217827 debye
polarizability: 418.9029349|-7.3970237|285.0195416|-21.5452212|-13.9012437|202.5572223 unknown
InChI: InChI=1S/C23H23N3/c1-2-24-22-21(18-12-6-3-7-13-18)25-26(20-16-10-5-11-17-20)23(22)19-14-8-4-9-15-19/h3-17,22-24H,2H2,1H3
charge 0 multiplicity 1
49 atoms
N  0.836249 -0.729936 -0.307656
N  -1.485434 1.183842 -1.888594
N  -0.361308 -1.347853 0.037569
C  0.69424 0.734149 -0.534948
C  -0.893275 0.90128 -0.577245
C  -1.355405 -0.465652 -0.045008
C  1.349193 1.581002 0.552375
C  2.017013 -1.483153 -0.462513
C  -2.729732 -0.803841 0.337208
C  -1.187183 2.495097 -2.496633
C  1.822075 2.880023 0.237997
C  1.429351 1.123873 1.891145
C  3.242996 -0.83549 -0.784618
C  1.992837 -2.898405 -0.308441
C  -3.786783 0.132312 0.148688
C  -3.033421 -2.070064 0.921449
C  -1.981335 2.686507 -3.799844
C  2.365752 3.710211 1.243294
C  1.970356 1.953918 2.897396
C  2.439297 3.249715 2.57854
C  4.417868 -1.597928 -0.952611
C  3.177237 -3.641459 -0.475268
C  -5.104238 -0.187119 0.538897
C  -4.351016 -2.384545 1.303047
C  4.399028 -3.003189 -0.800765
C  -5.39541 -1.444321 1.117161
H  1.112334 1.006368 -1.523528
H  -1.182097 1.724031 0.103667
H  -1.416032 0.397625 -2.547103
H  -1.469325 3.278854 -1.765281
H  -0.097283 2.641318 -2.707557
H  1.76852 3.241284 -0.797689
H  1.081801 0.114215 2.137789
H  3.287231 0.253407 -0.88198
H  1.046369 -3.386856 -0.065492
H  -3.56981 1.088976 -0.336331
H  -2.220914 -2.787902 1.072481
H  -1.704123 1.923877 -4.552517
H  -1.778859 3.679852 -4.238767
H  -3.06469 2.598548 -3.607352
H  2.734264 4.709984 0.98692
H  2.03088 1.588842 3.928755
H  2.862137 3.890952 3.359886
H  5.355188 -1.085379 -1.197707
H  3.14482 -4.730491 -0.354347
H  -5.907163 0.543138 0.386337
H  -4.567927 -3.360888 1.751383
H  5.315179 -3.588595 -0.93138
H  -6.419751 -1.690437 1.418596
