program: Gaussian 09
title: 000288895
version: EM64L-G09RevD.01
frameworkgroup: C1[X(C17H10ClNO2)]
method: RPBEPBE
basis: SDD
operation: Freq
keyword: #p
keyword: freq=noraman
keyword: PBEPBE/SDD
title: #p freq=noraman PBEPBE/SDD
converged: NO YES NO NO
title: Mulliken charges:
elementType: Cl O O N C C C C C C C C C C C C C C C C C H H H H H H H H H H
charge: -0.019968 -0.439803 -0.258340 0.072496 0.207476 -0.616960 -0.346721 0.360904 0.251646 0.058684 0.312373 0.044372 -0.430618 -0.408768 -0.391752 -0.226695 -0.230377 0.122427 -0.259329 -0.246103 -0.265329 0.264431 0.264808 0.248435 0.280521 0.305871 0.228543 0.232937 0.236501 0.259355 0.388982
chargesum: 0.00000
title: Mulliken charges with hydrogens summed into heavy atoms:
elementType: Cl O O N C C C C C C C C C C C C C C C C C
charge: -0.019968 -0.050821 -0.258340 0.072496 0.207476 -0.087721 -0.346721 0.360904 0.251646 0.058684 0.312373 0.044372 -0.182183 -0.128246 -0.085880 0.001848 0.002560 0.122427 -0.259329 -0.009602 -0.005974
polarizability: 3.55246001e+02 6.09622542e+00 2.49142709e+02 -3.26661830e-02 1.43152102e-02 7.90050341e+01
1716.lowfreq: -3.6214 -3.3579 -0.0019 -0.0019 -0.0015 3.8524 15.5160 49.3950 72.7445
frequency: 15.3913 49.3897 72.7442 79.2663 114.8863 166.7119 181.7727 185.3377 222.7832 234.5158 290.4787 307.1206 326.5132 333.0140 363.2872 394.9144 426.6012 443.0460 460.9005 490.4505 505.4378 553.2520 557.0629 580.1764 589.0175 612.2724 624.8388 650.3360 685.5572 708.9596 735.2789 744.5895 748.1273 777.3024 796.8415 804.5295 826.1456 836.0422 861.5711 882.4009 922.6805 938.3521 939.2463 972.2033 997.4022 998.3522 1005.1674 1022.5979 1062.7372 1083.0573 1099.2640 1141.3281 1142.8283 1168.3033 1182.4891 1196.0695 1207.5896 1211.8039 1251.0822 1277.7075 1290.2709 1313.4968 1343.8563 1367.5915 1394.5385 1402.4637 1416.0360 1439.8226 1460.8035 1471.1871 1492.3457 1547.3635 1576.2635 1596.5760 1606.2873 1624.8660 1630.6045 3007.1172 3048.8529 3126.5681 3139.5296 3147.6916 3154.7232 3169.0364 3172.9665 3196.8608 3506.2328
redmass: 11.2956 7.2710 5.0656 5.3186 8.4962 4.3424 5.4993 8.5736 9.2480 3.6031 2.9965 8.2153 6.7347 5.1897 9.5916 10.0352 3.1497 6.4538 4.4425 3.0154 5.6716 3.3087 4.1714 6.4380 6.7356 5.1183 1.4107 7.0267 3.5463 7.4596 6.6770 2.3424 3.3761 1.6084 2.3404 5.6519 2.9494 7.2053 5.6649 1.4061 1.3862 2.0045 7.3995 1.5953 1.3354 1.3192 4.7134 2.3075 2.5084 2.4135 2.0558 1.1397 2.8637 1.1497 1.6034 2.3512 1.7006 1.5288 2.6873 2.6842 2.3147 2.2437 3.6165 5.4965 4.5335 5.7637 1.1656 2.5937 2.6961 3.2109 4.9561 8.6780 10.4699 7.1771 6.9040 7.4770 8.1689 1.0624 1.0977 1.0863 1.0905 1.0886 1.0949 1.0996 1.0954 1.0947 1.0637
irintensity: 1.5155 1.3119 1.2563 0.2219 0.7348 0.8870 3.2903 0.5282 0.5081 2.4441 2.0058 1.9019 2.0686 1.0399 1.6370 4.7868 3.9166 2.4150 13.6291 0.0627 0.2723 13.1761 7.4573 5.5420 1.1119 89.9448 104.8429 8.4718 1.5167 16.2681 10.6276 58.6146 0.9397 115.5792 0.0006 8.0975 15.3346 1.6908 2.3055 1.2508 0.3253 1.2196 3.7473 6.4817 0.0002 2.9483 45.1804 24.3387 226.2152 66.1648 61.5038 0.0450 15.9231 3.6434 5.2706 16.7326 13.1430 3.0757 25.9323 0.4063 19.1360 35.7294 21.7150 9.3773 9.3209 32.0529 22.5532 37.6022 18.5678 20.7220 19.3422 27.6797 85.7023 3.3061 9.4604 15.5969 212.1005 3.4864 1.9461 1.2162 13.3999 10.2204 24.8105 26.6034 5.8933 15.1386 53.7526
temp: 298.150 k
press: 1.00000 atm
elementType: 17 8 8 7 6 6 6 6 6 6 6 6 6 6 6 6 6 6 6 6 6 1 1 1 1 1 1 1 1 1 1
symmnumber: 1
zpe: 584394.2 jmol-1
zpe.correction: 0.222584 hartree
zpe.thermalcorrener: 0.238620 hartree
zpe.thermalcorrenthalpy: 0.239564 hartree
zpe.thermalcorrgfe: 0.177656 hartree
zpe.sumelectzpe: -1317.685026 hartree
zpe.sumelectthermal: -1317.668990 hartree
zpe.sumelectthermalent: -1317.668046 hartree
zpe.sumelectthermalfe: -1317.729954 hartree
dipole: -2.1314 2.9937 0.0117
dipole: 3.6749
quadrupole: -106.3635 -120.2255 -130.6094
quadrupole: -4.2340 0.0510 0.0662
quadrupole: 12.7026 -1.1594 -11.5432 -4.2340 0.0510 0.0662
hfenergy: -1317.9076101 hartree
pointgroup: C01 [X(C17H10Cl1N1O2)]
dipole: -0.6610881 1.2837785 0.0727107 debye
polarizability: 354.7512011|-9.0184722|249.211848|-3.996061|8.0355113|79.4306953 unknown
InChI: InChI=1S/C17H10ClNO2/c18-13-7-3-6-11-14(17(20)21)12-8-9-4-1-2-5-10(9)15(12)19-16(11)13/h1-7,20H,8H2
charge 0 multiplicity 1
31 atoms
Cl 1.95923 -3.883446 -0.178296
O  0.262408 3.636222 0.199449
O  2.52628 3.243055 0.134299
N  0.184495 -1.469976 -0.043563
C  -0.383608 0.941244 0.076384
C  -1.679718 1.737603 0.130999
C  -0.709296 -0.472701 0.01424
C  -2.759722 0.663655 0.09358
C  -2.170262 -0.629438 0.02512
C  0.965815 1.324503 0.076178
C  1.983254 0.272911 0.014002
C  1.520114 -1.112854 -0.043944
C  -4.159184 0.800219 0.11769
C  -2.958244 -1.799591 -0.020539
C  3.39331 0.522852 0.007458
C  -4.957626 -0.370043 0.072284
C  -4.363018 -1.657784 0.003792
C  1.365292 2.763022 0.137298
C  2.505997 -2.156407 -0.104617
C  4.307742 -0.533013 -0.052603
C  3.872187 -1.888113 -0.109528
H  -1.753068 2.448002 -0.712837
H  -1.730185 2.363565 1.040771
H  -4.630215 1.788229 0.170559
H  -2.480096 -2.782487 -0.073354
H  3.748344 1.552895 0.04991
H  -6.049766 -0.281668 0.090074
H  -5.002827 -2.546247 -0.030396
H  5.381743 -0.319889 -0.056407
H  4.594466 -2.707848 -0.156553
H  0.619458 4.565628 0.235352
