program: Gaussian 09
title: 000288899
version: EM64L-G09RevD.01
frameworkgroup: C1[X(C19H17NO4)]
method: RPBEPBE
basis: SDD
operation: Freq
keyword: #p
keyword: freq=noraman
keyword: PBEPBE/SDD
title: #p freq=noraman PBEPBE/SDD
converged: YES YES NO NO
title: Mulliken charges:
elementType: O O O O N C C C C C C C C C C C C C C C C C C C H H H H H H H H H H H H H H H H H
charge: -0.282884 -0.196920 -0.203833 -0.195683 0.015336 0.192250 -0.271575 -0.576020 0.167745 0.020790 0.392680 0.131425 0.317800 -0.762860 -0.724095 -0.383349 -0.354695 0.178855 -0.337275 -0.240604 -0.247994 -0.375915 -0.228696 -0.211190 0.301836 0.242111 0.230697 0.221297 0.226952 0.217860 0.214986 0.252983 0.216186 0.237300 0.283088 0.289946 0.231006 0.238274 0.287251 0.241179 0.243757
chargesum: 0.00000
title: Mulliken charges with hydrogens summed into heavy atoms:
elementType: O O O O N C C C C C C C C C C C C C C C C C C C
charge: -0.282884 -0.196920 -0.203833 -0.195683 0.015336 0.192250 0.030261 -0.103213 0.167745 0.020790 0.392680 0.131425 0.317800 -0.096750 -0.039940 -0.146048 -0.071607 0.178855 -0.047330 -0.009599 -0.009721 -0.088664 0.012483 0.032566
polarizability: 3.05701275e+02 2.78683013e+01 2.18027384e+02 1.87632648e+00 1.36484324e+00 1.62058857e+02
1716.lowfreq: -6.4162 0.0007 0.0008 0.0010 4.2430 11.9486 22.0010 25.0486 43.0776
frequency: 21.5597 24.6724 43.0388 58.4479 76.1371 105.6289 110.7557 126.1936 153.8596 179.6114 205.9011 223.8595 230.8622 256.3356 267.5700 284.5213 295.4181 309.9974 332.4997 347.6491 368.1216 381.0673 391.6248 410.5483 432.3309 443.7181 471.2613 498.3438 523.2663 538.2444 550.9201 587.8460 610.7109 632.6083 654.5982 666.7565 674.5369 687.5505 711.6138 734.6623 770.0145 771.6736 780.7981 792.0618 798.5274 826.4662 837.2741 863.5790 895.9798 905.0997 919.5685 938.1005 951.7252 967.2681 978.0161 987.9580 1005.1142 1009.0428 1012.4188 1035.3269 1037.9593 1054.1155 1062.7937 1083.3786 1107.8645 1136.9580 1141.1764 1158.5072 1172.3781 1177.9821 1200.2688 1207.1284 1213.5131 1225.0976 1251.8853 1264.7901 1278.1852 1287.9412 1305.5124 1322.1085 1364.2233 1376.5587 1380.5808 1384.4591 1392.4795 1401.3673 1432.5571 1437.9013 1442.4136 1462.3553 1465.7002 1471.4229 1472.8903 1486.4232 1489.6747 1566.7440 1577.0341 1581.5807 1611.5763 1614.5809 2976.4044 2977.7747 2981.5614 3052.3630 3070.4484 3076.4131 3079.5743 3092.3410 3098.5213 3130.7025 3143.4552 3146.3869 3156.9270 3161.3114 3169.0252 3173.4892 3186.0910
redmass: 8.3345 4.9835 7.5323 6.6284 7.7893 3.7178 3.9658 4.4808 3.5605 5.8372 1.2865 5.6996 5.0476 1.1176 4.4678 2.2997 4.1162 4.2200 3.0614 4.7836 3.1933 6.6074 7.4522 4.0862 3.7337 4.0320 4.6378 3.8413 4.5889 4.5268 3.2113 4.9310 5.3295 5.7883 5.8502 7.0258 4.9801 5.2378 3.8722 4.1757 4.4900 2.3531 2.6485 1.5326 3.3359 4.9507 4.5831 3.3576 1.4499 1.4171 2.1360 1.4307 2.7560 2.2204 1.3942 1.3609 1.3504 1.3403 1.4050 2.2675 2.6319 1.8616 3.0350 2.1331 1.6109 1.9239 1.8380 2.7283 1.1269 1.0840 2.1763 2.0477 5.1332 2.4361 1.8724 1.8177 1.4353 1.9911 2.3714 1.9113 7.9513 6.5925 1.2539 4.4856 3.3764 1.3902 2.5301 2.1883 1.1331 1.0540 1.3767 1.4240 2.7065 1.1727 1.0602 8.4107 6.5911 7.9951 6.9081 6.8464 1.0577 1.0367 1.0395 1.0976 1.0995 1.0992 1.1000 1.0998 1.0872 1.0859 1.0870 1.0892 1.0941 1.0914 1.1004 1.0957 1.0975
irintensity: 1.7507 1.0689 1.0265 0.5090 0.3233 1.2133 3.2915 0.3793 0.7068 3.5475 0.7255 1.2656 3.1738 0.4655 1.6525 1.1239 0.7505 0.8009 1.2792 8.8850 0.2326 3.0049 3.3923 0.8721 1.0938 2.0723 0.1344 8.9866 2.0533 1.5210 11.6505 8.9239 7.7024 1.8284 12.8412 4.2152 49.3882 9.0110 18.8758 8.3297 5.7391 44.4381 13.8963 54.8813 3.9964 12.1477 23.9278 17.3929 0.6380 3.0885 8.8515 1.4811 5.6590 21.5800 2.6624 3.0951 0.2056 0.4189 1.1305 10.6070 9.7672 17.8536 7.5581 16.5502 0.5320 4.6061 3.8802 4.8688 13.9762 4.5811 46.3875 7.0882 159.2628 100.3080 10.3503 6.7563 60.2212 2.8834 93.9266 5.8671 133.3090 13.6071 27.7462 8.6589 27.3216 17.4663 6.3583 19.6051 16.0270 2.0726 6.5781 11.4005 43.0196 22.0124 14.4627 50.1565 15.4061 98.1638 31.5030 22.9836 11.0414 25.4908 26.0132 10.9355 6.1827 61.2353 28.5579 23.6476 20.2086 2.0023 4.2768 7.0598 14.2154 8.6946 33.3745 5.9455 8.9712
temp: 298.150 k
press: 1.00000 atm
elementType: 8 8 8 8 7 6 6 6 6 6 6 6 6 6 6 6 6 6 6 6 6 6 6 6 1 1 1 1 1 1 1 1 1 1 1 1 1 1 1 1 1
symmnumber: 1
zpe: 828089.3 jmol-1
zpe.correction: 0.315403 hartree
zpe.thermalcorrener: 0.336064 hartree
zpe.thermalcorrenthalpy: 0.337008 hartree
zpe.thermalcorrgfe: 0.265268 hartree
zpe.sumelectzpe: -1088.054555 hartree
zpe.sumelectthermal: -1088.033894 hartree
zpe.sumelectthermalent: -1088.032950 hartree
zpe.sumelectthermalfe: -1088.104690 hartree
dipole: -0.0817 5.7297 -2.3558
dipole: 6.1956
quadrupole: -109.3500 -143.2135 -148.0493
quadrupole: 13.2812 7.7297 -3.8220
quadrupole: 24.1876 -9.6758 -14.5117 13.2812 7.7297 -3.8220
hfenergy: -1088.3699578 hartree
pointgroup: C01 [X(C19H17N1O4)]
dipole: -0.0524333 -2.2845503 -0.8483719 debye
polarizability: 307.6029746|24.5044823|215.9562622|-3.1563968|-3.2215983|162.2282792 unknown
InChI: InChI=1S/C19H17NO4/c1-18(2)11-19(16(21)12-7-3-5-9-14(12)18)17(24-19)13-8-4-6-10-15(13)20(22)23/h3-10,17H,11H2,1-2H3
charge 0 multiplicity 1
41 atoms
O  -0.451779 -0.665603 1.979415
O  1.159201 1.844696 1.781681
O  -3.511762 2.563626 -1.746671
O  -1.544019 2.274071 -0.638142
N  -2.740242 1.896012 -0.955742
C  0.150631 -0.073405 0.695731
C  -1.201741 0.370464 1.184517
C  0.324976 -1.014523 -0.476143
C  1.721867 -1.702975 -0.501657
C  1.309562 0.874803 0.982862
C  2.816352 -0.619257 -0.438623
C  2.60165 0.589118 0.298194
C  -2.490961 -0.102839 0.577711
C  1.808542 -2.556081 -1.793153
C  1.875433 -2.63877 0.737923
C  4.084021 -0.808209 -1.042255
C  3.634315 1.559647 0.413033
C  -3.246027 0.621381 -0.388866
C  -3.045057 -1.324583 1.039029
C  5.104587 0.161014 -0.928614
C  4.882972 1.352961 -0.196325
C  -4.494093 0.161694 -0.871037
C  -4.284533 -1.799313 0.562457
C  -5.015452 -1.054072 -0.393628
H  -1.20472 1.357159 1.666019
H  0.194559 -0.428005 -1.408924
H  -0.466551 -1.785338 -0.454599
H  0.93942 -3.237475 -1.846206
H  1.805626 -1.924314 -2.700288
H  2.714939 -3.186742 -1.812389
H  2.86657 -3.127077 0.732733
H  1.769091 -2.084909 1.686153
H  1.0986 -3.425702 0.716314
H  4.282608 -1.719943 -1.61384
H  3.421881 2.465995 0.989743
H  -2.476755 -1.885649 1.78642
H  6.072886 -0.012566 -1.41182
H  5.67486 2.103982 -0.108469
H  -5.024233 0.766659 -1.611128
H  -4.684085 -2.745865 0.941769
H  -5.980042 -1.41667 -0.762386
