program: Gaussian 09
title: 000288885
version: EM64L-G09RevD.01
frameworkgroup: C1[X(C13H18N2O)]
method: RPBEPBE
basis: SDD
operation: Freq
keyword: #p
keyword: freq=noraman
keyword: PBEPBE/SDD
title: #p freq=noraman PBEPBE/SDD
converged: NO YES NO NO
title: Mulliken charges:
elementType: O N N C C C C C C C C C C C C C H H H H H H H H H H H H H H H H H H
charge: -0.442131 -0.093475 -0.078724 -0.354156 -0.359541 -0.396974 -0.393360 -0.398789 -0.465237 0.064676 0.285721 -0.365002 -0.353678 -0.254169 -0.242345 -0.235435 0.175976 0.236495 0.210416 0.176049 0.205256 0.193934 0.193260 0.202332 0.189305 0.214343 0.224752 0.224494 0.294393 0.292218 0.223969 0.225564 0.227475 0.372389
chargesum: 0.00000
title: Mulliken charges with hydrogens summed into heavy atoms:
elementType: O N N C C C C C C C C C C C C C
charge: -0.069742 -0.093475 -0.078724 0.058316 0.026924 0.002216 0.002232 0.004860 -0.015992 0.064676 0.285721 -0.070609 -0.061460 -0.030201 -0.016782 -0.007961
polarizability: 1.89451704e+02 5.30986126e+00 1.81491315e+02 -1.24918859e+01 1.39469679e+00 1.05114772e+02
1716.lowfreq: -25.8276 -14.3160 -10.0766 -0.0004 -0.0003 0.0002 12.5404 34.2954 41.6272
frequency: -16.0158 34.2539 41.5595 73.6859 135.2818 142.5789 217.0426 221.0937 256.2744 270.7083 288.0395 311.1555 356.1483 381.6480 400.6153 404.4776 443.5057 452.8290 467.6494 483.1470 547.8925 614.6168 616.0110 688.1416 700.8599 723.6102 754.7186 787.9663 801.1340 849.4117 852.2203 862.7197 873.8593 903.5803 946.8235 954.7494 980.4918 986.1065 994.9644 1000.1075 1005.3328 1027.0102 1046.2495 1067.8215 1079.1658 1087.8217 1097.7618 1119.4712 1148.3486 1149.4681 1173.8302 1193.2016 1203.4784 1248.3671 1261.6962 1263.1232 1268.4292 1287.4162 1297.5740 1328.6182 1333.8587 1337.7950 1340.5147 1349.5567 1364.5386 1377.9431 1388.5178 1435.3886 1449.3300 1453.9239 1459.5485 1464.4509 1466.5804 1478.0604 1480.8631 1570.7176 1578.8165 1608.8450 2824.7616 2839.4363 2898.8917 2966.3225 2982.6504 2984.9340 3014.8338 3018.0884 3034.3227 3043.6492 3049.9218 3054.1693 3119.5388 3128.8280 3140.2379 3157.4561 3203.7122 3558.8546
redmass: 3.2043 3.6474 4.0020 4.6931 3.2607 4.0336 3.4281 2.1967 3.7177 6.5027 2.7291 3.5533 2.7279 1.7826 2.6524 2.9198 2.9241 3.2376 1.4130 3.5434 1.9616 4.4613 4.7105 5.3960 1.7500 5.4552 3.0097 2.1135 1.5320 1.5109 2.7901 1.2551 4.2195 2.4748 1.4310 1.3030 2.5109 3.3424 1.5340 2.1799 1.4086 2.9419 2.1897 2.3484 1.4433 1.6769 2.4983 2.5869 2.4502 1.2796 1.0580 1.3303 1.1351 1.5637 1.6673 1.9629 1.2346 1.2873 1.3426 1.2564 1.3529 1.3738 1.4559 1.4992 1.4123 5.5549 1.4859 2.2592 1.0922 1.0928 1.0870 1.0981 1.0774 1.3214 1.6056 5.4635 6.2155 5.7619 1.0714 1.0705 1.0676 1.0631 1.0618 1.0614 1.0881 1.0897 1.0956 1.1025 1.0916 1.1005 1.0860 1.0897 1.0944 1.1000 1.0941 1.0674
irintensity: 0.2663 0.0614 0.2965 0.2074 1.2657 2.6811 0.1944 0.3950 0.5286 0.3307 1.8206 3.1846 5.3285 3.8720 14.3957 21.3608 1.6339 5.0620 79.9568 2.5780 7.9532 22.8163 14.3749 21.2704 66.3270 11.4149 28.5834 32.9184 1.6958 2.6387 10.4059 1.4317 103.6515 22.6388 7.2945 4.9541 51.6759 1.0023 0.1911 30.0751 2.8967 6.4699 10.6666 3.3893 3.1976 1.5398 20.3135 5.6609 14.8664 6.0813 1.2536 1.6929 9.5833 19.1857 9.6468 24.3348 38.8144 13.0198 28.4548 11.9392 1.6420 6.9833 6.5186 1.6711 2.6681 3.4771 1.1843 5.9170 8.7211 11.9815 12.8624 13.3348 4.9787 4.4513 25.7318 9.4221 1.1721 0.3006 61.3138 132.0395 71.7226 41.2182 27.5365 30.5457 29.6493 51.4652 65.4763 32.5865 15.7454 92.3533 5.8343 12.1214 14.4009 46.0555 5.7237 48.6886
temp: 298.150 k
press: 1.00000 atm
elementType: 8 7 7 6 6 6 6 6 6 6 6 6 6 6 6 6 1 1 1 1 1 1 1 1 1 1 1 1 1 1 1 1 1 1
symmnumber: 1
zpe: 754459.2 jmol-1
zpe.correction: 0.287358 hartree
zpe.thermalcorrener: 0.301332 hartree
zpe.thermalcorrenthalpy: 0.302276 hartree
zpe.thermalcorrgfe: 0.246121 hartree
zpe.sumelectzpe: -689.636067 hartree
zpe.sumelectthermal: -689.622093 hartree
zpe.sumelectthermalent: -689.621149 hartree
zpe.sumelectthermalfe: -689.677304 hartree
dipole: 0.9751 0.0246 -0.2194
dipole: 0.9998
quadrupole: -88.3001 -86.4965 -97.4248
quadrupole: -0.9755 -2.1007 1.8862
quadrupole: 2.4403 4.2440 -6.6843 -0.9755 -2.1007 1.8862
hfenergy: -689.9234251 hartree
pointgroup: C01 [X(C13H18N2O1)]
dipole: -0.3857993 0.0314131 -0.0700335 debye
polarizability: 190.8616549|2.7913795|179.1903742|10.3885772|11.102326|106.0057626 unknown
InChI: InChI=1S/C13H18N2O/c16-14-13(12-7-3-1-4-8-12)11-15-9-5-2-6-10-15/h1,3-4,7-8,16H,2,5-6,9-11H2
charge 0 multiplicity 1
34 atoms
O  1.771952 -3.039613 -0.229598
N  -1.658885 0.083356 -0.411832
N  0.560337 -2.424721 -0.785994
C  -2.177646 -0.879058 0.596865
C  -2.764849 0.785686 -1.117923
C  -3.052391 -0.161123 1.643195
C  -3.660119 1.549351 -0.121376
C  -4.214276 0.594639 0.960031
C  -0.733818 -0.559915 -1.386369
C  0.560446 -1.097151 -0.762232
C  1.606322 -0.148429 -0.29373
C  1.234427 1.206263 -0.037572
C  2.978048 -0.513409 -0.134307
C  2.195267 2.15912 0.355809
C  3.934874 0.449736 0.249841
C  3.552826 1.787958 0.498753
H  -2.778554 -1.685978 0.099784
H  -1.31864 -1.370624 1.085509
H  -2.31955 1.48859 -1.848164
H  -3.396236 0.060147 -1.697304
H  -2.42167 0.555474 2.20453
H  -3.439536 -0.904051 2.366797
H  -4.485474 2.040028 -0.672556
H  -3.059524 2.345202 0.360873
H  -4.899756 -0.138277 0.485439
H  -4.807753 1.15636 1.705977
H  -1.224129 -1.412169 -1.914757
H  -0.46862 0.200774 -2.145706
H  0.175167 1.476601 -0.109385
H  3.284747 -1.543614 -0.316275
H  1.884966 3.191062 0.556027
H  4.983872 0.151242 0.358732
H  4.30078 2.529213 0.802799
H  1.551295 -4.003969 -0.297781
