program: Gaussian 09
title: 000288877
version: EM64L-G09RevD.01
frameworkgroup: C1[X(C16H16O2)]
method: RPBEPBE
basis: SDD
operation: Freq
keyword: #pfreq=noraman
keyword: PBEPBE/SDD
title: #p freq=noraman PBEPBE/SDD
converged: YES YES NO NO
title: Mulliken charges:
elementType: O O C C C C C C C C C C C C C C C C H H H H H H H H H H H H H H H H
charge: -0.428877 -0.207928 0.050893 0.484439 -0.700297 -0.757193 -0.367356 -0.424672 0.142133 0.359315 -0.435477 -0.420809 0.336550 -0.398426 -0.396001 -0.237145 -0.237219 -0.242677 0.225427 0.242481 0.226447 0.231149 0.254652 0.220472 0.231824 0.241497 0.236209 0.236373 0.237639 0.240376 0.377737 0.224462 0.225120 0.228884
chargesum: 0.00000
title: Mulliken charges with hydrogens summed into heavy atoms:
elementType: O O C C C C C C C C C C C C C C C C
charge: -0.051140 -0.207928 0.050893 0.484439 -0.005942 -0.050919 -0.135532 -0.183175 0.142133 0.359315 -0.199268 -0.184436 0.336550 -0.160788 -0.155626 -0.012684 -0.012100 -0.013793
polarizability: 2.86509233e+02 -6.54312828e+00 1.63984651e+02 -5.60509321e+00 -6.19634618e+00 1.00693105e+02
1716.lowfreq: -5.4938 -0.4789 -0.0005 -0.0002 0.0004 10.1071 31.4982 36.9117 42.6728
frequency: 31.4771 36.8819 42.6648 75.0082 84.9952 126.3599 164.3327 212.9831 218.0250 250.1443 259.5170 285.5826 305.3085 340.3448 348.8707 399.6623 404.7355 406.9389 415.2321 424.5637 508.2309 541.5234 584.5679 587.3435 590.6738 614.8522 639.4450 659.6515 702.4748 726.4158 739.0630 744.5840 772.5469 807.1572 842.2527 843.6191 850.9076 917.9777 923.0884 944.8516 958.1482 969.6764 973.9700 988.6197 993.6724 996.6679 1012.4530 1016.1190 1020.3149 1041.4037 1084.6581 1112.8883 1117.5263 1144.5571 1173.1770 1177.4756 1192.3224 1211.7567 1260.9150 1282.8912 1292.7637 1306.3022 1318.4374 1355.6861 1374.0468 1377.2754 1398.3737 1412.5915 1437.6636 1462.9634 1469.7510 1478.3180 1487.4893 1491.7582 1518.7110 1565.8891 1588.7235 1613.4398 1624.1344 1652.4409 2991.4831 2993.1237 3087.3565 3091.0754 3105.6043 3110.3550 3121.9429 3125.5169 3128.4138 3131.6466 3140.4895 3148.3758 3151.1080 3163.5345 3164.8909 3516.7192
redmass: 5.3486 7.3745 4.5518 3.9127 4.7945 4.8954 4.6121 1.3569 4.1473 3.7891 1.9301 3.5647 1.1239 3.5884 2.9388 4.2861 2.8576 3.4229 3.7541 4.7309 3.3697 3.5754 3.2624 2.3121 1.4356 6.4142 6.9102 5.0271 1.7595 5.1506 3.8086 3.4509 2.0653 2.8413 1.2821 1.6299 1.2549 1.6741 1.8368 1.5727 1.3682 1.3992 1.4383 4.9988 1.3146 6.0337 2.1931 1.6705 2.5568 1.9548 1.6233 2.4066 2.0997 1.8916 1.0559 1.8286 1.1153 1.1122 2.4122 2.8049 3.1062 1.4386 1.3276 3.0858 3.9993 1.3796 1.2114 3.5292 2.3736 1.0725 1.0516 2.0845 1.0534 1.0648 2.7592 6.0058 6.4635 6.0550 6.3394 9.2127 1.0345 1.0356 1.1008 1.0999 1.1009 1.0997 1.0844 1.0874 1.0870 1.0880 1.0918 1.0964 1.0958 1.0954 1.1003 1.0641
irintensity: 0.2815 0.2493 0.7207 0.0689 0.4221 0.5061 0.8522 0.2250 0.1069 0.6067 0.1449 0.1729 0.3504 6.0021 3.4623 7.6293 0.3203 0.8616 1.6060 4.4548 7.9594 5.5172 10.4675 45.3935 103.0635 0.1756 1.1581 22.0917 46.6507 23.3565 10.6810 18.2323 57.4589 0.3930 2.2119 31.3913 0.6671 7.8002 10.7912 3.4436 1.9384 1.2811 0.3405 0.3616 0.2599 31.3271 146.2596 182.2865 66.2037 1.7765 8.6176 2.8430 3.2618 2.9137 0.0775 6.6800 0.4164 0.5274 30.2624 4.5449 0.0109 3.4487 0.8299 2.9355 2.4470 14.8124 6.6358 8.0946 3.3180 3.6543 7.7070 44.8657 18.1434 25.9066 10.0636 2.9793 1.0270 9.0141 2.7448 202.9620 24.1719 13.5939 14.1883 29.2472 2.6026 52.6770 9.1175 4.0891 12.9491 11.7983 11.4800 25.8139 35.3046 21.2930 16.8706 25.7034
temp: 298.150 k
press: 1.00000 atm
elementType: 8 8 6 6 6 6 6 6 6 6 6 6 6 6 6 6 6 6 1 1 1 1 1 1 1 1 1 1 1 1 1 1 1 1
symmnumber: 1
zpe: 720764.8 jmol-1
zpe.correction: 0.274525 hartree
zpe.thermalcorrener: 0.290855 hartree
zpe.thermalcorrenthalpy: 0.291799 hartree
zpe.thermalcorrgfe: 0.229752 hartree
zpe.sumelectzpe: -768.479368 hartree
zpe.sumelectthermal: -768.463038 hartree
zpe.sumelectthermalent: -768.462093 hartree
zpe.sumelectthermalfe: -768.524141 hartree
dipole: -1.0726 1.1480 0.7949
dipole: 1.7608
quadrupole: -87.4487 -98.2436 -110.6810
quadrupole: 0.0951 -0.6632 -4.3929
quadrupole: 11.3424 0.5475 -11.8899 0.0951 -0.6632 -4.3929
hfenergy: -768.7538927 hartree
pointgroup: C01 [X(C16H16O2)]
dipole: -0.4216647 -0.5271694 -0.1555586 debye
polarizability: 286.5036592|8.1361808|154.3612721|2.2962059|-23.6348368|110.322058 unknown
InChI: InChI=1S/C16H16O2/c1-16(2,15(17)18)14-10-8-13(9-11-14)12-6-4-3-5-7-12/h3-11,17H,1-2H3
charge 0 multiplicity 1
34 atoms
O  -5.286451 0.787273 -0.031217
O  -3.36633 1.993998 0.411173
C  -3.214587 -0.488989 0.022544
C  -1.681776 -0.337178 0.07584
C  -3.619783 -1.122407 -1.350471
C  -3.784346 -1.383774 1.163674
C  -1.02388 0.551903 -0.814886
C  -0.8734 -1.107517 0.946628
C  -3.893162 0.89135 0.15479
C  1.192311 -0.114541 0.033989
C  0.377939 0.661646 -0.836694
C  0.533764 -0.99928 0.926711
C  2.678863 0.00165 0.011613
C  3.505557 -1.1243 0.281816
C  3.312118 1.241828 -0.280218
C  4.91232 -1.015271 0.262003
C  4.718729 1.352258 -0.302743
C  5.527462 0.224085 -0.031407
H  -3.145652 -2.115633 -1.441219
H  -4.714289 -1.235279 -1.418943
H  -3.275906 -0.50476 -2.198222
H  -3.518044 -0.993718 2.162135
H  -4.882463 -1.430341 1.087954
H  -3.389265 -2.410837 1.070856
H  -1.6133 1.17674 -1.494772
H  -1.332799 -1.794169 1.663747
H  0.850333 1.340341 -1.55569
H  1.124144 -1.58694 1.638941
H  3.042694 -2.098051 0.478932
H  2.698506 2.132046 -0.459145
H  -5.689247 1.690012 0.085028
H  5.528581 -1.898474 0.465112
H  5.183901 2.320125 -0.521494
H  6.619658 0.309405 -0.048067
