program: Gaussian 09
title: 000288879
version: EM64L-G09RevD.01
frameworkgroup: C1[X(C19H20O2)]
method: RPBEPBE
basis: SDD
operation: Freq
keyword: #pfreq=noraman
keyword: PBEPBE/SDD
title: #p freq=noraman PBEPBE/SDD
converged: YES YES NO NO
title: Mulliken charges:
elementType: O O C C C C C C C C C C C C C C C C C C C H H H H H H H H H H H H H H H H H H H H
charge: -0.410738 -0.239365 0.152819 -0.458668 -0.468998 -0.423097 -0.434696 -0.390101 0.430946 0.097083 -0.377657 -0.423685 -0.436947 -0.421047 0.360396 0.335493 -0.395850 -0.396488 -0.237409 -0.237863 -0.242270 0.212970 0.230849 0.234981 0.193954 0.198154 0.226570 0.215637 0.198040 0.203953 0.188926 0.255859 0.250259 0.238299 0.236260 0.376480 0.238699 0.238042 0.225455 0.225224 0.229528
chargesum: 0.00000
title: Mulliken charges with hydrogens summed into heavy atoms:
elementType: O O C C C C C C C C C C C C C C C C C C C
charge: -0.034258 -0.239365 0.152819 -0.014849 -0.040063 0.001628 -0.021018 0.002778 0.430946 0.097083 -0.121798 -0.173426 -0.198648 -0.184787 0.360396 0.335493 -0.157152 -0.158446 -0.011954 -0.012638 -0.012742
polarizability: 3.28770792e+02 -1.31175275e+00 1.87806252e+02 1.09856878e+00 1.04897674e+01 1.33616116e+02
1716.lowfreq: -0.0007 -0.0006 -0.0001 5.0935 6.5431 12.2581 33.1674 36.2176 60.0174
frequency: 33.1545 36.1042 60.0137 75.6673 78.9293 99.8070 120.8705 146.3807 176.9020 193.6793 212.1409 272.4739 292.8460 314.8682 347.1932 368.0280 382.4429 403.2786 406.4150 410.5437 441.2781 487.0261 495.3705 515.3048 526.7448 556.9841 588.5572 614.3769 624.9280 638.3940 664.6217 701.1463 702.2326 739.9674 749.4649 771.6914 789.1033 808.2146 834.0483 841.6290 849.7010 850.9639 897.5768 913.0670 920.9976 928.8746 930.9754 962.3536 973.8665 974.6006 988.7487 993.6787 995.6829 1004.9156 1022.5145 1035.8153 1043.1729 1062.6429 1080.5222 1085.0180 1103.7737 1129.8630 1144.1168 1159.5447 1173.3380 1184.0455 1193.3581 1212.2965 1214.1701 1248.2813 1266.3760 1278.6140 1292.3200 1302.5894 1306.5419 1317.6368 1324.9787 1337.5586 1341.4977 1344.4226 1355.5669 1359.8807 1374.5559 1412.2120 1437.4525 1451.7373 1463.2765 1469.1866 1472.7196 1477.2091 1479.1420 1514.3852 1563.1987 1588.1663 1613.1402 1618.0764 1636.0331 2966.5507 2975.9628 2981.5861 2984.8215 2991.8175 3030.3601 3035.6834 3046.6708 3063.3430 3068.8996 3122.4302 3124.2638 3127.6112 3132.4676 3140.9208 3146.9855 3149.5198 3164.9293 3168.3500 3507.9594
redmass: 4.1803 4.7811 10.2289 3.8734 4.2879 4.4358 5.1343 3.5273 3.2985 4.5163 5.1206 2.4567 2.2360 5.4596 4.4029 4.0126 2.2650 3.0632 3.2947 2.9182 3.7206 3.2039 2.6782 3.2982 2.2332 2.4084 2.0063 6.3658 2.5162 6.8490 3.6361 3.8170 1.8219 3.1837 5.1021 2.0411 1.4726 2.0313 2.1265 1.6867 1.4111 1.2816 2.2144 2.0619 1.4967 2.1409 1.6475 1.4115 1.4423 1.4091 4.7831 1.3141 6.0868 3.1979 2.6628 2.4367 1.9383 1.9059 1.4483 1.6117 1.6763 1.4401 1.6399 2.2965 1.0527 2.9412 1.1417 1.7883 1.2341 1.3911 1.3902 1.2226 2.8584 2.0022 1.4534 1.3433 1.3292 1.3826 1.4975 1.4660 2.5517 1.5386 7.1469 3.6355 2.3760 1.0925 1.1020 1.0828 1.1107 1.9343 1.1052 2.6738 6.0138 6.4026 6.0306 6.2881 8.5528 1.0628 1.0634 1.0636 1.0616 1.0647 1.0957 1.1005 1.1011 1.0984 1.0996 1.0845 1.0871 1.0875 1.0885 1.0920 1.0958 1.0960 1.1015 1.0939 1.0639
irintensity: 0.0077 0.2310 1.4420 0.0854 0.0727 0.1637 0.1136 0.1765 0.3146 0.1338 0.0346 1.9317 0.5991 1.1782 0.6918 0.9844 2.4562 0.6404 0.4357 0.0920 0.5479 5.3804 7.4104 21.6981 7.9880 21.6878 72.7097 0.4624 35.8046 0.9977 46.2456 35.9457 42.0458 22.0316 7.8321 57.0160 0.2866 2.3024 15.7227 9.3490 12.7787 2.4482 11.8786 15.2675 2.4618 2.1258 7.0131 3.0490 0.2025 1.7479 0.2060 0.0547 15.3647 16.0050 25.0082 185.2475 8.4441 16.6643 6.8584 9.4184 1.5969 5.7699 4.0633 7.0892 0.0128 3.5612 0.6321 2.8604 3.2531 1.3581 3.8093 3.3187 0.6440 13.8724 5.1735 1.2234 0.9858 0.3199 3.0995 3.0354 3.1640 0.3192 0.3201 7.3536 3.6609 7.8733 15.0167 11.0773 29.7142 41.9203 12.7918 13.8680 1.3697 2.1558 11.0567 9.5098 172.9719 39.2051 29.5741 22.2673 31.6476 27.5726 77.2412 46.3927 60.4978 17.6724 27.9805 11.4717 4.4919 4.5579 11.7047 15.1073 2.9258 46.5705 29.1469 8.8407 27.0671
temp: 298.150 k
press: 1.00000 atm
elementType: 8 8 6 6 6 6 6 6 6 6 6 6 6 6 6 6 6 6 6 6 6 1 1 1 1 1 1 1 1 1 1 1 1 1 1 1 1 1 1 1 1
symmnumber: 1
zpe: 892000.9 jmol-1
zpe.correction: 0.339745 hartree
zpe.thermalcorrener: 0.357793 hartree
zpe.thermalcorrenthalpy: 0.358737 hartree
zpe.thermalcorrgfe: 0.293079 hartree
zpe.sumelectzpe: -884.979877 hartree
zpe.sumelectthermal: -884.961830 hartree
zpe.sumelectthermalent: -884.960886 hartree
zpe.sumelectthermalfe: -885.026543 hartree
dipole: -0.1296 1.4205 -0.2612
dipole: 1.4501
quadrupole: -112.5662 -121.0755 -122.5174
quadrupole: 4.9980 -0.2269 3.5786
quadrupole: 6.1535 -2.3558 -3.7977 4.9980 -0.2269 3.5786
hfenergy: -885.3196227 hartree
pointgroup: C01 [X(C19H20O2)]
dipole: -0.0518687 0.1299895 0.5530773 debye
polarizability: 328.7783787|-0.4687811|132.7098956|-1.118302|-7.7781979|188.7048863 unknown
InChI: InChI=1S/C19H20O2/c20-18(21)19(13-5-2-6-14-19)17-11-9-16(10-12-17)15-7-3-1-4-8-15/h1,3-4,7-12,20H,2,5-6,13-14H2
charge 0 multiplicity 1
41 atoms
O  2.932698 -2.331994 0.421704
O  3.100332 -1.613734 -1.767402
C  2.494578 0.042248 0.001122
C  2.996931 1.155372 -0.976793
C  3.131105 0.270162 1.402071
C  4.539276 1.26158 -1.02822
C  4.674196 0.349312 1.344161
C  5.147982 1.460276 0.378723
C  0.94092 0.041113 0.034248
C  2.887764 -1.336141 -0.564644
C  0.213946 -0.188807 -1.164803
C  0.201271 0.278707 1.218603
C  -1.193278 -0.175101 -1.177991
C  -1.209017 0.298851 1.203092
C  -1.939983 0.072757 0.006872
C  -3.431155 0.088916 -0.004784
C  -4.149961 0.542294 -1.145875
C  -4.177453 -0.348841 1.124896
C  -5.560898 0.556937 -1.15812
C  -5.588288 -0.332117 1.115562
C  -6.288732 0.120523 -0.026746
H  2.565101 2.114438 -0.628032
H  2.601896 0.966084 -1.99009
H  2.81794 -0.528937 2.096265
H  2.745228 1.231845 1.796729
H  4.821922 2.102168 -1.690806
H  4.952888 0.342976 -1.488613
H  5.085094 -0.627809 1.019053
H  5.067348 0.531552 2.362773
H  6.253309 1.472161 0.319195
H  4.83627 2.447618 0.77842
H  0.753726 -0.405732 -2.093993
H  0.717494 0.456086 2.165882
H  -1.720287 -0.3930 -2.113649
H  -1.747931 0.521035 2.131082
H  3.118077 -3.206389 -0.017419
H  -3.600037 0.914062 -2.017808
H  -3.649404 -0.734172 2.004474
H  -6.092556 0.917657 -2.045841
H  -6.141394 -0.681719 1.994624
H  -7.384219 0.132462 -0.035223
