program: Gaussian 09
title: 000288860
version: EM64L-G09RevD.01
frameworkgroup: C1[X(C13H13NO)]
method: RPBEPBE
basis: SDD
operation: Freq
keyword: #p
keyword: freq=noraman
keyword: PBEPBE/SDD
title: #p freq=noraman PBEPBE/SDD
converged: YES YES NO NO
title: Mulliken charges:
elementType: O N C C C C C C C C C C C C C H H H H H H H H H H H H H
charge: -0.217627 -0.150678 -0.379039 -0.365929 -0.465022 -0.457183 0.311310 0.183831 -0.555951 0.239616 -0.054904 -0.311967 -0.406968 -0.266796 -0.223281 0.227931 0.244501 0.231819 0.246185 0.235616 0.230148 0.236713 0.228709 0.259022 0.243976 0.278304 0.225464 0.232201
chargesum: 0.00000
title: Mulliken charges with hydrogens summed into heavy atoms:
elementType: O N C C C C C C C C C C C C C
charge: -0.217627 -0.150678 0.093393 0.112075 0.000742 0.008239 0.311310 0.183831 -0.296928 0.239616 -0.054904 -0.067991 -0.128664 -0.041332 0.008920
polarizability: 2.15740841e+02 -5.11453768e+00 1.73481271e+02 -7.72972772e-01 1.70701091e+00 7.40277396e+01
1716.lowfreq: -7.5333 -5.2214 0.0005 0.0005 0.0006 10.3348 54.2125 76.6461 123.0927
frequency: 54.0206 76.6203 123.0643 149.1215 157.9800 209.1756 239.3305 248.1516 249.3561 325.5119 338.7283 409.9884 472.9791 528.2584 572.2414 576.9684 625.3048 641.1068 679.3410 690.0876 735.5008 761.0872 764.9860 772.7134 816.3531 854.7058 865.1647 886.6259 891.7088 918.1952 928.4954 953.9368 986.7027 991.1562 1019.5177 1054.8534 1069.2878 1107.3201 1110.9983 1126.4799 1147.2488 1166.7455 1172.7306 1180.0733 1200.8027 1223.7986 1242.0117 1279.9262 1283.2697 1308.4341 1316.3358 1325.0057 1344.6811 1369.6714 1429.1593 1444.2338 1456.0481 1470.3726 1474.7473 1487.5844 1496.7356 1574.3733 1600.4455 1603.3470 1625.2236 2962.3923 2966.4575 3012.3321 3013.5903 3037.0072 3053.4342 3084.1750 3096.4335 3129.3841 3145.8366 3160.2041 3174.3501 3218.0474
redmass: 3.4592 2.9820 3.6094 5.2093 3.4362 3.6045 5.9569 1.8153 3.5245 5.6527 5.2120 2.9719 4.8101 7.7243 2.8351 3.1535 4.6794 4.4367 2.1956 4.2941 4.6671 1.4296 2.7854 2.7924 2.4761 1.6929 1.8622 1.7130 2.8690 2.5435 1.4022 1.4295 1.6355 1.3748 2.4004 2.8776 2.0972 1.7433 1.6542 2.7972 2.2135 1.3785 1.3658 1.3914 2.1116 1.2800 1.2810 1.5679 2.2971 1.3463 1.2469 1.6514 1.6273 3.7272 3.5737 2.6110 3.5446 1.0883 1.0925 1.0895 1.1001 7.2932 8.5301 8.1381 8.4879 1.0636 1.0658 1.0692 1.0625 1.0957 1.0974 1.1004 1.1050 1.0856 1.0909 1.0964 1.0959 1.0958
irintensity: 0.0604 0.8706 0.8310 0.7434 1.0296 1.8918 4.6170 0.0255 5.3139 0.3360 1.8145 2.2221 0.3276 11.1978 3.8679 1.4746 2.3772 0.7352 6.5180 0.5830 0.7853 107.5506 22.8171 2.8367 10.6042 0.9416 1.7291 3.9744 26.4617 9.6679 1.0011 2.5979 2.1045 1.0883 12.3990 2.4725 1.2271 46.9830 10.1510 5.9391 9.0030 2.9733 2.1339 4.4368 59.6702 7.0523 3.3996 12.4804 26.3553 4.8106 0.2022 1.4287 15.9498 39.5358 55.0365 3.2600 3.2641 11.4084 36.0058 2.5627 30.8417 730.1163 34.9585 29.9505 30.8697 53.2075 17.0213 27.6133 18.9523 32.5426 20.6850 30.9268 47.2628 2.1539 11.1998 26.7430 19.1986 3.1436
temp: 298.150 k
press: 1.00000 atm
elementType: 8 7 6 6 6 6 6 6 6 6 6 6 6 6 6 1 1 1 1 1 1 1 1 1 1 1 1 1
symmnumber: 1
zpe: 599686.6 jmol-1
zpe.correction: 0.228409 hartree
zpe.thermalcorrener: 0.240531 hartree
zpe.thermalcorrenthalpy: 0.241475 hartree
zpe.thermalcorrgfe: 0.189813 hartree
zpe.sumelectzpe: -632.084394 hartree
zpe.sumelectthermal: -632.072272 hartree
zpe.sumelectthermalent: -632.071328 hartree
zpe.sumelectthermalfe: -632.122990 hartree
dipole: 6.1074 -5.0454 -0.1070
dipole: 7.9226
quadrupole: -75.9984 -93.6751 -90.7481
quadrupole: 12.3748 0.4189 -0.2384
quadrupole: 10.8087 -6.8679 -3.9409 12.3748 0.4189 -0.2384
hfenergy: -632.3128028 hartree
pointgroup: C01 [X(C13H13N1O1)]
dipole: -2.4465097 1.9242401 0.1659309 debye
polarizability: 215.9492204|-4.2168544|172.5093893|0.2153819|8.8421259|74.7912424 unknown
InChI: InChI=1S/C13H13NO/c15-13-9-12(14-7-3-4-8-14)10-5-1-2-6-11(10)13/h1-2,5-6,9H,3-4,7-8H2
charge 0 multiplicity 1
28 atoms
O  2.257353 -2.768679 -0.253009
N  -1.801017 -0.103299 -0.067388
C  -2.354994 1.252814 0.190871
C  -2.876462 -1.11304 -0.250202
C  -3.857845 0.991391 0.448982
C  -4.159445 -0.268333 -0.402478
C  -0.483346 -0.468057 -0.087499
C  0.689711 0.475688 -0.001743
C  -0.005512 -1.783645 -0.206962
C  1.866375 -0.32649 -0.054528
C  1.454887 -1.784287 -0.18443
C  0.806654 1.875808 0.085089
C  3.146805 0.230347 -0.007546
C  2.108646 2.451443 0.135259
C  3.265715 1.644969 0.094341
H  -2.208467 1.908322 -0.691417
H  -1.861711 1.720746 1.06023
H  -2.923047 -1.782867 0.633286
H  -2.661804 -1.738187 -1.13625
H  -4.481876 1.857686 0.174026
H  -4.024152 0.774146 1.519983
H  -5.057211 -0.809855 -0.062217
H  -4.307693 0.011199 -1.461584
H  -0.601641 -2.692244 -0.279089
H  -0.061927 2.538778 0.105068
H  4.026526 -0.420134 -0.053033
H  2.209286 3.540422 0.204766
H  4.256091 2.111561 0.135673
