program: Gaussian 09
title: 000003635
version: EM64L-G09RevD.01
frameworkgroup: C1[X(C21H26N2O2S)]
method: RPBEPBE
basis: SDD
operation: Freq
keyword: #p
keyword: freq=noraman
keyword: PBEPBE/SDD
title: #p freq=noraman PBEPBE/SDD
converged: YES YES NO NO
title: Mulliken charges:
elementType: S O O N N C C C C C C C C C C C C C C C C C C C C C H H H H H H H H H H H H H H H H H H H H H H H H H H
charge: 0.214561 -0.359023 -0.448480 -0.113319 -0.413294 -0.367988 -0.459385 -0.357794 0.310027 0.253531 -0.317174 -0.317248 -0.483498 0.545512 0.098214 -0.400347 0.398995 -0.447853 -0.309677 -0.675125 -0.672683 -0.541612 -0.344029 -0.309611 -0.247544 -0.224481 0.200307 0.225193 0.200840 0.213984 0.214754 0.241574 0.187368 0.202768 0.186477 0.199267 0.374748 0.254661 0.230830 0.222020 0.210263 0.206559 0.220912 0.227049 0.203461 0.211482 0.209247 0.287702 0.244894 0.233946 0.233654 0.345363
chargesum: 0.00000
title: Mulliken charges with hydrogens summed into heavy atoms:
elementType: S O O N N C C C C C C C C C C C C C C C C C C C C C
charge: 0.214561 -0.359023 -0.103117 -0.113319 -0.038546 0.057512 -0.044561 0.098535 0.310027 0.253531 0.072962 0.068496 -0.483498 0.545512 0.098214 -0.145687 0.398995 -0.217023 -0.309677 -0.036282 -0.021261 -0.120883 -0.056327 -0.064717 -0.013598 0.009173
polarizability: 3.69048807e+02 3.15115169e+01 3.33400880e+02 -4.23119217e+01 9.02497469e+00 1.70444242e+02
1716.lowfreq: -13.5353 -7.6002 -1.1325 -0.0015 -0.0014 0.0007 5.3799 11.5474 21.5833
frequency: -9.9309 10.3683 21.4822 42.7895 49.1727 53.5505 64.8635 70.0356 83.9136 90.4343 123.9866 134.3414 156.1866 172.5076 180.3687 191.7905 209.7752 211.3015 213.5301 230.6452 270.5078 288.6770 292.0690 294.2455 303.8061 333.3525 355.9451 372.4327 394.7700 421.8327 425.3062 432.0816 439.7012 457.2235 460.6148 487.7741 491.2197 509.0185 523.5119 553.5907 599.9498 614.9764 651.0322 683.4246 699.1793 716.7736 733.4196 746.0818 760.2218 786.4733 796.0295 796.3995 807.9768 820.6997 840.1076 846.4934 868.7056 880.9041 882.4694 910.6343 922.3081 945.6207 955.8077 962.8288 971.5185 996.3559 1005.1572 1009.4145 1030.9308 1039.3340 1059.6951 1073.0931 1076.0089 1080.9713 1083.7616 1106.2520 1114.1299 1123.4417 1143.1114 1161.0540 1171.4203 1173.5272 1178.2924 1199.2537 1220.1743 1226.1942 1246.2255 1254.0025 1261.2672 1278.6118 1284.4602 1288.1148 1295.8473 1323.4185 1346.9632 1349.6730 1360.1725 1362.5779 1367.8444 1373.5192 1378.7713 1387.3202 1390.8713 1391.0926 1398.1534 1410.8229 1424.8464 1456.6756 1458.9640 1462.0344 1463.8604 1469.6348 1471.5795 1475.9343 1478.9727 1483.0725 1487.5551 1491.1526 1497.1245 1537.7136 1570.7379 1588.1821 1602.2006 1617.9929 2849.0909 2856.1244 2874.2507 2939.2212 2943.3116 2982.3954 2982.7337 2982.9590 3000.5046 3000.6422 3023.6534 3031.4952 3034.6829 3053.3900 3075.1801 3076.3973 3088.5759 3089.1144 3125.3194 3130.6355 3143.4933 3159.1953 3160.3435 3172.7026 3178.3032 3553.6470
redmass: 3.9709 4.5257 3.6134 6.6407 4.6497 4.2651 3.1455 3.7404 1.9646 2.8926 3.6265 3.7600 1.4414 5.1465 1.8178 3.5052 3.7887 3.0202 1.5754 1.6935 3.7364 2.3541 2.1424 3.4233 4.0906 2.7917 3.8283 4.1576 4.4602 3.7375 3.9901 5.0447 3.3385 4.2873 2.5896 4.6604 5.3616 4.7586 3.2202 5.8963 4.4808 4.4608 5.8456 4.5953 2.4579 7.4631 4.6486 3.6192 1.7574 1.2603 1.2108 1.7322 1.8457 1.8508 1.3175 3.6704 3.4174 1.4245 2.7259 2.1075 5.7767 2.1260 1.6643 1.7875 1.3681 1.9680 1.3396 2.6272 2.9975 2.1932 3.3945 2.0337 1.9036 2.5404 2.0087 2.6488 2.0733 1.9763 1.8404 1.2579 1.1934 1.6528 1.5834 2.0077 1.2878 1.1762 1.5492 1.4225 1.7556 1.5486 1.2834 1.2513 1.2604 2.8137 2.0364 1.5850 1.3505 1.9615 1.3206 3.7972 1.4683 1.2372 2.6581 1.4272 1.7538 4.0801 2.4211 1.1187 2.3045 1.0584 1.0561 1.1184 1.0796 1.1560 1.0610 1.0742 1.0669 1.0929 4.1384 3.2484 5.8009 2.6640 6.2394 7.3437 1.0722 1.0718 1.0714 1.0582 1.0594 1.0412 1.0526 1.0475 1.0924 1.1037 1.0868 1.0873 1.0939 1.0944 1.0986 1.0981 1.1004 1.1003 1.0898 1.0861 1.0904 1.0942 1.0833 1.0988 1.0932 1.0667
irintensity: 0.1148 0.2487 0.2454 2.8999 0.2844 0.8383 0.3197 0.4678 0.2367 0.8817 0.4838 1.7413 162.0665 0.6604 1.5540 7.4244 0.6128 0.5787 0.2440 3.7755 0.9963 4.1148 2.9681 9.5321 1.2587 5.8341 2.4263 1.2290 8.2192 0.5854 1.0616 0.7608 5.5885 10.7147 3.4045 4.6117 5.2422 2.7741 13.0290 15.0936 5.7357 9.0496 10.0757 5.6882 14.9688 1.6465 8.3698 20.4684 24.6397 2.5820 21.2386 91.3528 14.7795 25.9765 75.2605 2.4648 6.8897 0.2149 3.6995 2.6832 57.8249 13.3759 6.4820 7.3589 2.1038 8.0444 1.1558 13.2613 20.4715 21.2283 15.2316 9.1620 21.1374 6.9228 3.4971 13.4022 5.8096 15.4893 16.3263 44.5922 7.1509 6.1506 27.0667 33.6078 5.5551 19.1211 18.8966 24.0086 47.3683 49.6851 59.4101 20.1359 9.0300 180.7233 8.0838 10.3195 3.4076 41.5681 2.7717 14.9474 2.0207 23.1565 2.2088 7.1185 35.2904 57.2241 92.7452 16.1503 9.2246 4.9429 5.3703 9.5742 29.0986 139.8194 8.2224 13.2068 10.3755 39.9052 146.0453 82.9980 31.5762 218.9108 16.2898 351.7920 32.3984 108.7062 195.7703 66.1364 53.9020 43.0558 26.5003 9.6036 51.7719 43.1242 15.7977 26.8451 5.5332 62.6679 49.1100 66.6178 30.0121 49.5206 19.8434 0.5465 10.2439 32.2123 90.1548 26.4351 13.6740 4.4561
temp: 298.150 k
press: 1.00000 atm
elementType: 16 8 8 7 7 6 6 6 6 6 6 6 6 6 6 6 6 6 6 6 6 6 6 6 6 6 1 1 1 1 1 1 1 1 1 1 1 1 1 1 1 1 1 1 1 1 1 1 1 1 1 1
symmnumber: 1
zpe: 1119618.9 jmol-1
zpe.correction: 0.426440 hartree
zpe.thermalcorrener: 0.451752 hartree
zpe.thermalcorrenthalpy: 0.452696 hartree
zpe.thermalcorrgfe: 0.369273 hartree
zpe.sumelectzpe: -1471.915316 hartree
zpe.sumelectthermal: -1471.890005 hartree
zpe.sumelectthermalent: -1471.889061 hartree
zpe.sumelectthermalfe: -1471.972483 hartree
dipole: 0.9295 0.0591 2.2311
dipole: 2.4177
quadrupole: -135.4806 -150.2715 -165.0737
quadrupole: 3.5246 -14.0256 5.0453
quadrupole: 14.7946 0.0038 -14.7985 3.5246 -14.0256 5.0453
hfenergy: -1472.3417566 hartree
pointgroup: C01 [X(C21H26N2O2S1)]
dipole: 0.3661708 0.092654 -0.8729865 debye
polarizability: 370.699568|-35.3779497|326.9629827|38.0552147|29.1998507|175.2313784 unknown
InChI: InChI=1S/C21H26N2O2S/c1-3-23(4-2)13-7-12-22-17-11-10-15(14-24)21-19(17)20(25)16-8-5-6-9-18(16)26-21/h5-6,8-11,22,24H,3-4,7,12-14H2,1-2H3
charge 0 multiplicity 1
52 atoms
S  -3.685817 -0.660081 -0.424449
O  -0.05701 1.521695 1.248989
O  -3.968444 -3.748425 -0.353808
N  4.649647 0.666992 -0.334198
N  1.417025 -0.559856 1.114044
C  3.998868 1.103628 0.929603
C  3.714111 -0.076222 1.891276
C  2.758892 -1.12678 1.294101
C  0.367939 -1.219509 0.529657
C  -0.922449 -0.542374 0.339356
C  6.118766 0.483613 -0.176334
C  4.300437 1.532844 -1.495042
C  -1.988786 -1.308063 -0.244294
C  -1.820453 -2.644483 -0.687793
C  -1.046546 0.877377 0.702269
C  0.515763 -2.573362 0.095375
C  -2.285239 1.660507 0.426294
C  -0.550762 -3.247458 -0.501803
C  -3.485986 1.105787 -0.084703
C  6.721215 -0.501988 -1.196248
C  2.870297 1.29585 -2.01719
C  -2.926673 -3.417759 -1.360203
C  -2.256959 3.058711 0.703149
C  -4.628444 1.917265 -0.305471
C  -3.380124 3.870063 0.481891
C  -4.574773 3.294467 -0.025241
H  4.615158 1.867758 1.465395
H  3.044792 1.599256 0.677205
H  4.662336 -0.583641 2.152614
H  3.295386 0.322548 2.837495
H  2.712929 -2.01468 1.960089
H  3.173017 -1.452263 0.3176
H  6.65693 1.464441 -0.233875
H  6.302194 0.089933 0.840949
H  4.439496 2.616525 -1.247928
H  5.012604 1.305046 -2.309043
H  1.194574 0.419986 1.392039
H  1.473148 -3.080883 0.231906
H  -0.413235 -4.283776 -0.833827
H  6.236365 -1.489675 -1.104087
H  6.586386 -0.154366 -2.23635
H  7.807086 -0.622095 -1.022483
H  2.744607 0.239795 -2.314151
H  2.103225 1.52553 -1.255854
H  2.671889 1.93735 -2.896313
H  -2.512851 -4.352075 -1.789699
H  -3.375727 -2.816867 -2.180863
H  -1.3216 3.4644 1.09993
H  -5.547946 1.468349 -0.697182
H  -3.336626 4.941926 0.701091
H  -5.458021 3.918105 -0.20134
H  -4.831512 -3.901668 -0.816546
