program: Gaussian 09
title: 000288863
version: EM64L-G09RevD.01
frameworkgroup: C1[X(C17H21NO)]
method: RPBEPBE
basis: SDD
operation: Freq
keyword: #p
keyword: freq=noraman
keyword: PBEPBE/SDD
title: #p freq=noraman PBEPBE/SDD
converged: YES YES NO NO
title: Mulliken charges:
elementType: O N C C C C C C C C C C C C C C C C C H H H H H H H H H H H H H H H H H H H H H
charge: -0.245426 -0.135018 0.008160 -0.462258 -0.442365 -0.383809 -0.374128 0.275523 -0.398100 -0.360759 0.538446 0.091400 -0.102333 -0.708316 -0.711299 -0.425411 -0.372083 -0.258097 -0.246048 0.219533 0.225292 0.282746 0.200149 0.197445 0.212825 0.205326 0.201229 0.217105 0.188434 0.230491 0.211303 0.223221 0.238296 0.237390 0.222804 0.209682 0.241109 0.286375 0.227475 0.233688
chargesum: 0.00000
title: Mulliken charges with hydrogens summed into heavy atoms:
elementType: O N C C C C C C C C C C C C C C C C C
charge: -0.245426 -0.135018 0.008160 -0.017433 0.040531 0.026461 0.032427 0.275523 0.007439 -0.130268 0.538446 0.091400 -0.102333 -0.035496 -0.041423 -0.184302 -0.085707 -0.030623 -0.012359
polarizability: 2.58785896e+02 2.62983839e+00 2.08002894e+02 1.10274701e+01 2.69557240e+00 1.21719866e+02
1716.lowfreq: -14.5876 -3.8639 -0.0007 -0.0006 -0.0004 8.1530 21.7552 50.2658 60.4693
frequency: 20.4679 50.2158 60.3901 91.8587 111.4162 144.0733 166.0269 211.3337 226.3838 245.9139 263.6426 271.0177 295.7034 304.3631 317.5404 350.0208 355.5494 398.7871 431.9110 442.8196 448.0227 461.4069 470.1589 489.7264 514.1135 550.6666 561.3854 596.5572 647.2007 694.6427 721.6211 754.5640 771.8312 798.6705 803.8773 812.1205 825.6541 841.3489 844.2448 881.6256 895.0671 904.5400 924.1283 941.9818 951.1235 974.4643 978.9062 1002.8617 1009.2300 1014.1576 1031.0824 1045.3622 1077.6257 1083.7606 1105.2349 1106.3672 1116.3099 1142.9551 1151.1284 1173.8725 1174.6354 1205.6039 1212.1753 1247.4436 1255.0446 1263.4243 1275.2880 1312.2222 1323.7525 1331.4883 1335.0580 1341.9922 1349.0072 1354.6777 1372.3595 1388.3559 1393.8711 1405.0286 1435.5100 1457.2070 1459.2193 1462.1926 1464.3827 1466.5448 1468.9795 1472.6327 1478.4144 1483.2314 1487.5603 1538.3932 1576.8666 1604.0580 1613.3150 2958.8550 2962.9796 2967.7930 2977.0453 2977.1182 2979.1019 2980.2303 3029.2523 3036.8403 3046.0582 3055.6187 3071.6758 3076.9965 3089.1630 3093.0476 3112.6528 3122.0009 3124.4885 3138.7389 3152.1287 3166.2008
redmass: 4.2607 3.3559 4.1430 3.7046 3.6791 3.3495 2.6963 2.9324 1.2695 2.1717 1.3101 1.7788 2.8571 3.6375 3.2772 2.7075 4.7258 3.2720 2.8632 3.2689 3.1331 2.8384 5.6260 2.8918 3.7438 2.2426 2.7090 3.4911 5.1096 6.1750 3.5394 4.9058 1.5601 3.3351 1.5453 3.5794 1.4647 3.2132 1.4515 2.5062 1.4866 2.6192 1.6293 2.2734 1.4185 1.3921 2.1555 1.3343 1.2810 2.4165 2.3479 2.2408 1.5524 2.0153 3.1719 3.1851 1.9116 1.9243 1.2378 1.0788 2.2905 2.0112 1.8744 1.2881 1.7196 2.0099 1.3587 2.5499 1.2456 1.3355 1.5040 1.4270 1.3146 1.6457 1.1711 5.5301 1.3436 2.9827 2.3608 1.0896 1.0547 1.0863 1.0595 1.1117 1.7151 1.0915 1.0569 1.1044 1.3211 9.3032 7.3862 7.0051 6.5053 1.0676 1.0635 1.0711 1.0532 1.0423 1.0594 1.0354 1.0962 1.1021 1.1016 1.0977 1.1002 1.0996 1.1010 1.1004 1.0878 1.0930 1.0852 1.0896 1.0941 1.0996
irintensity: 0.8960 0.5186 1.4820 1.2509 1.0104 0.8597 0.1258 0.7510 0.0684 1.0486 1.1348 1.0898 1.2017 1.3851 0.4427 0.4832 13.0054 0.7790 2.2543 1.9512 1.0472 0.6821 1.4660 3.9258 2.5034 8.8074 2.6110 0.3845 11.7549 1.1226 21.5943 3.1193 61.5286 2.1740 0.7089 10.2991 12.4736 2.5320 21.0181 3.6936 0.1890 3.8270 0.5484 18.0738 14.1670 2.2454 62.1731 0.3497 0.4441 5.7009 45.8069 21.1895 2.2571 20.3425 9.1028 6.4230 10.9843 2.7134 1.1794 1.6238 61.4657 84.5806 14.5072 3.8629 34.3080 12.9490 21.3341 1.1231 4.2082 1.6571 9.8163 1.4816 1.6945 44.3936 14.8756 11.9547 9.8765 14.7857 7.7103 5.0048 0.3864 10.6571 8.7727 10.7302 2.4541 30.1203 9.3969 24.1900 18.8071 179.1976 124.0758 110.2878 41.6792 38.2487 35.4360 85.8843 6.3029 51.9213 16.2844 57.0888 75.3679 40.5761 94.7888 43.7471 0.7799 60.2650 15.7171 35.8811 38.3952 8.3151 1.5391 18.5871 14.2736 30.0260
temp: 298.150 k
press: 1.00000 atm
elementType: 8 7 6 6 6 6 6 6 6 6 6 6 6 6 6 6 6 6 6 1 1 1 1 1 1 1 1 1 1 1 1 1 1 1 1 1 1 1 1 1
symmnumber: 1
zpe: 891259.5 jmol-1
zpe.correction: 0.339463 hartree
zpe.thermalcorrener: 0.356609 hartree
zpe.thermalcorrenthalpy: 0.357553 hartree
zpe.thermalcorrgfe: 0.294734 hartree
zpe.sumelectzpe: -788.971607 hartree
zpe.sumelectthermal: -788.954460 hartree
zpe.sumelectthermalent: -788.953516 hartree
zpe.sumelectthermalfe: -789.016335 hartree
dipole: -0.2628 3.4774 1.0096
dipole: 3.6305
quadrupole: -96.8007 -113.8604 -117.4035
quadrupole: -0.4786 1.4988 -3.1578
quadrupole: 12.5542 -4.5056 -8.0486 -0.4786 1.4988 -3.1578
hfenergy: -789.3110696 hartree
pointgroup: C01 [X(C17H21N1O1)]
dipole: -0.1287653 -1.3919372 -0.2934132 debye
polarizability: 257.8698916|-4.1086638|208.0262404|-15.1911652|-3.2947131|122.6125246 unknown
InChI: InChI=1S/C17H21NO/c1-17(2)12-15(18-10-6-3-7-11-18)16(19)13-8-4-5-9-14(13)17/h4-5,8-9,12H,3,6-7,10-11H2,1-2H3
charge 0 multiplicity 1
40 atoms
O  -0.147805 2.45474 0.398733
N  -2.141654 0.433976 0.730371
C  1.078359 -1.642927 0.078592
C  -3.058402 -0.622736 1.208741
C  -2.889384 1.547825 0.084891
C  -3.904763 -1.235356 0.061227
C  -3.737044 1.028122 -1.106168
C  -0.814882 0.112722 0.383217
C  -4.687558 -0.111179 -0.663539
C  -0.353349 -1.188567 0.268557
C  2.046987 -0.478884 -0.130213
C  1.597629 0.868932 -0.060804
C  0.177682 1.230725 0.244933
C  1.508804 -2.465037 1.343703
C  1.110127 -2.593421 -1.166035
C  3.421675 -0.721836 -0.38415
C  2.518458 1.938286 -0.248699
C  4.328477 0.339689 -0.573917
C  3.874385 1.681622 -0.507303
H  -3.749443 -0.150134 1.938141
H  -2.484593 -1.392222 1.753746
H  -2.183232 2.330504 -0.220846
H  -3.563089 1.987876 0.849543
H  -4.600835 -1.992929 0.471613
H  -3.241361 -1.751291 -0.660537
H  -3.057105 0.663124 -1.901979
H  -4.317163 1.869458 -1.533392
H  -5.236526 -0.520385 -1.532873
H  -5.448841 0.302621 0.031084
H  -1.068277 -2.018116 0.342051
H  0.808629 -3.30545 1.504939
H  2.524044 -2.88366 1.219342
H  1.502126 -1.826967 2.244345
H  0.824709 -2.047372 -2.081841
H  2.116292 -3.024064 -1.314856
H  0.400838 -3.429559 -1.022082
H  3.790535 -1.752256 -0.434914
H  2.130515 2.959458 -0.178011
H  5.384952 0.126119 -0.772032
H  4.576579 2.509354 -0.653779
