program: Gaussian 09
title: 000288853
version: EM64L-G09RevD.01
frameworkgroup: C1[X(C13H15NO2)]
method: RPBEPBE
basis: SDD
operation: Freq
keyword: #p
keyword: freq=noraman
keyword: PBEPBE/SDD
title: #p freq=noraman PBEPBE/SDD
converged: NO YES NO NO
title: Mulliken charges:
elementType: O O N C C C C C C C C C C C C C H H H H H H H H H H H H H H H
charge: -0.245753 -0.189757 -0.100165 -0.184954 -0.570128 0.316696 -0.345116 -0.344818 0.147909 -0.040573 -0.316884 -0.321628 -0.408800 -0.366665 -0.215136 -0.224690 0.244585 0.252371 0.253600 0.207809 0.200636 0.193853 0.229422 0.215688 0.191182 0.192170 0.217440 0.269833 0.274773 0.231629 0.235469
chargesum: 0.00000
title: Mulliken charges with hydrogens summed into heavy atoms:
elementType: O O N C C C C C C C C C C C C C
charge: -0.245753 -0.189757 -0.100165 0.059631 -0.064157 0.316696 0.063329 0.078457 0.147909 -0.040573 0.089987 0.087982 -0.138967 -0.091892 0.016494 0.010779
polarizability: 1.76162968e+02 -6.63193607e+00 1.61676025e+02 1.69279114e+01 4.31245501e+00 1.02074383e+02
1716.lowfreq: -12.0773 -6.5150 -5.0922 -0.0006 -0.0003 0.0005 35.0049 56.2945 65.7715
frequency: 34.9635 56.2666 65.7674 121.3149 150.1824 212.9639 217.0213 231.4072 255.2999 299.3478 332.3126 395.8171 404.2443 451.3808 467.4697 501.0657 517.0348 534.2589 568.6600 581.2822 628.9850 648.2774 717.4060 744.0447 774.2696 777.6959 799.5834 834.9032 845.7109 892.9836 901.4497 934.9913 967.9025 985.1966 1004.0160 1004.4610 1008.2384 1026.5445 1036.8887 1052.1775 1078.4869 1082.0494 1102.6212 1117.8487 1139.4671 1159.4083 1169.0630 1174.6518 1191.2316 1209.3150 1234.3288 1246.0682 1268.6316 1278.2503 1281.1281 1298.0571 1323.0595 1338.8596 1357.7723 1370.8030 1374.8329 1398.7697 1430.7969 1442.7695 1449.6307 1451.7698 1452.4682 1460.0018 1462.7570 1597.1616 1608.2169 1636.9314 2874.4320 2882.3207 2956.5107 2960.1842 2969.5893 3004.9071 3019.9275 3040.1825 3072.9131 3082.0223 3085.7304 3129.5785 3143.4982 3154.4738 3166.6810
redmass: 4.6779 3.3599 4.7071 4.3750 3.4384 4.0315 2.8514 3.7506 2.5256 4.8198 3.2996 2.1000 2.8449 3.7649 3.0424 3.2398 5.3274 3.2911 4.7499 3.3174 2.4557 4.0196 4.0488 4.6522 2.0288 1.7370 3.9378 2.6509 1.9378 2.0261 1.4904 2.8044 1.9689 2.2445 1.4863 2.1746 2.8317 2.1674 2.8378 2.0722 3.4016 2.3669 2.2033 1.5961 2.4504 1.6072 1.3715 1.7365 1.0693 1.3589 1.5767 1.4606 1.6769 1.5008 1.5878 1.4130 1.3181 1.2140 1.3736 1.2745 1.4249 7.6394 1.1133 1.0839 1.8340 1.2128 1.1486 2.4734 1.1286 7.5979 7.3815 11.4755 1.0697 1.0685 1.0663 1.0664 1.0835 1.0632 1.0902 1.0898 1.0983 1.0967 1.0982 1.0858 1.0895 1.0953 1.1004
irintensity: 3.0407 0.4141 0.5798 4.0947 4.2251 2.6265 1.8462 3.8535 0.1894 3.0222 13.8245 0.7356 1.0003 0.7027 2.1854 14.3819 2.9408 3.1302 5.5396 2.0302 6.1892 1.8641 3.3687 3.1762 37.9315 47.7593 13.4341 13.1654 4.1869 5.5474 0.6855 0.8370 4.9663 6.6861 10.3811 21.9418 24.7450 7.5334 27.5686 19.5896 26.1265 32.8267 3.8925 11.9445 43.0266 15.3370 16.2188 7.8492 1.6249 17.4432 21.0776 42.5504 34.3147 38.5058 8.4857 4.3946 27.7267 14.1679 4.7723 2.2723 1.2296 7.5103 11.7654 2.3838 9.9906 11.5927 9.7607 8.2341 6.1050 7.0644 98.3435 214.1154 44.0405 93.5212 32.3062 96.2702 16.2686 7.3623 47.4993 23.7596 9.9439 39.4523 33.4319 1.4804 5.6370 12.7965 27.0894
temp: 298.150 k
press: 1.00000 atm
elementType: 8 8 7 6 6 6 6 6 6 6 6 6 6 6 6 6 1 1 1 1 1 1 1 1 1 1 1 1 1 1 1
symmnumber: 1
zpe: 668197.8 jmol-1
zpe.correction: 0.254503 hartree
zpe.thermalcorrener: 0.267851 hartree
zpe.thermalcorrenthalpy: 0.268795 hartree
zpe.thermalcorrgfe: 0.213836 hartree
zpe.sumelectzpe: -708.379291 hartree
zpe.sumelectthermal: -708.365943 hartree
zpe.sumelectthermalent: -708.364999 hartree
zpe.sumelectthermalfe: -708.419958 hartree
dipole: -0.5224 -3.0039 -1.7011
dipole: 3.4914
quadrupole: -104.6928 -96.7234 -92.1271
quadrupole: -13.7781 5.3074 -4.3181
quadrupole: -6.8450 1.1244 5.7207 -13.7781 5.3074 -4.3181
hfenergy: -708.6337937 hartree
pointgroup: C01 [X(C13H15N1O2)]
dipole: 0.1185905 1.2410169 -0.576748 debye
polarizability: 176.788374|-4.2774507|161.315078|-17.4612065|-0.9086376|101.8099242 unknown
InChI: InChI=1S/C13H15NO2/c15-13-9-12(14-5-7-16-8-6-14)10-3-1-2-4-11(10)13/h1-4,12H,5-9H2
charge 0 multiplicity 1
31 atoms
O  4.115787 0.520459 0.752281
O  -2.285758 -2.937376 0.358633
N  1.49615 0.125106 -0.414939
C  0.227879 -0.494952 -0.862801
C  -0.106613 -1.950001 -0.358537
C  -1.003847 0.317421 -0.454915
C  2.704237 -0.471825 -1.034523
C  1.665015 0.257653 1.05333
C  -2.042316 -0.512438 0.03124
C  -1.591286 -1.930921 0.056911
C  3.934715 0.390415 -0.703753
C  2.907094 1.115069 1.350058
C  -1.193012 1.710467 -0.548303
C  -3.294291 0.018422 0.419744
C  -2.441018 2.250087 -0.155667
C  -3.486596 1.412196 0.322106
H  0.28033 -0.51182 -1.971122
H  0.502338 -2.212799 0.527973
H  0.070674 -2.73705 -1.111379
H  2.566085 -0.510883 -2.132553
H  2.887784 -1.514161 -0.673952
H  1.793972 -0.73279 1.555181
H  0.768907 0.743278 1.481176
H  4.86162 -0.077598 -1.074504
H  3.81415 1.398019 -1.15668
H  2.7571 2.140484 0.948959
H  3.109272 1.162473 2.432666
H  -0.385154 2.3532 -0.913136
H  -4.079607 -0.64977 0.788492
H  -2.609984 3.331014 -0.222136
H  -4.44283 1.858521 0.616152
