program: Gaussian 09
title: 000288875
version: EM64L-G09RevD.01
frameworkgroup: C1[X(C16H29NOS)]
method: RPBEPBE
basis: SDD
operation: Freq
keyword: #p
keyword: freq=noraman
keyword: PBEPBE/SDD
title: #p freq=noraman PBEPBE/SDD
converged: YES YES NO NO
title: Mulliken charges:
elementType: S O N C C C C C C C C C C C C C C C C H H H H H H H H H H H H H H H H H H H H H H H H H H H H H
charge: -0.070840 -0.238924 -0.039119 0.000586 0.415693 -0.471415 -0.478192 -0.465265 -0.413502 -0.411439 -0.381263 -0.781655 -0.802449 -0.498042 -0.255566 -0.354925 -0.389020 -0.303836 -0.294654 0.173297 0.198284 0.201208 0.199579 0.220641 0.207699 0.249658 0.195957 0.191535 0.190360 0.198807 0.198622 0.189976 0.206151 0.208347 0.219249 0.215858 0.231813 0.213636 0.216350 0.281860 0.258600 0.229487 0.239431 0.242656 0.227825 0.208073 0.194002 0.224861
chargesum: 0.00000
title: Mulliken charges with hydrogens summed into heavy atoms:
elementType: S O N C C C C C C C C C C C C C C C C
charge: -0.070840 -0.238924 -0.039119 0.173883 0.415693 -0.071923 -0.057972 -0.007907 -0.026010 -0.022272 0.007334 -0.147907 -0.141141 0.000169 -0.255566 0.133162 0.093067 0.132063 0.124210
polarizability: 2.11276300e+02 5.99770157e+00 1.95170939e+02 -1.92628394e+00 1.64347674e+01 1.81639813e+02
1716.lowfreq: -9.3547 -0.0013 -0.0011 -0.0008 2.6137 17.3905 21.5279 28.4804 43.2096
frequency: 19.7572 26.9295 42.9853 57.1414 63.2965 79.4128 98.1737 131.0225 176.4870 192.5626 204.8984 219.2446 237.8747 257.6601 275.4204 286.8821 304.5802 308.6473 316.9426 345.3341 362.8860 393.2529 404.9307 417.6301 434.4842 434.8244 449.6562 468.1309 479.5558 488.0525 550.6082 575.2675 621.7628 681.9363 746.6538 769.8739 786.1445 796.1660 800.1712 831.4357 843.5356 846.2113 873.7283 893.3588 901.5056 916.5289 923.3837 929.4247 954.4631 965.3989 998.0565 1002.4396 1011.2290 1021.9800 1026.5934 1045.7850 1054.8588 1063.1417 1070.3083 1075.6804 1096.0655 1115.6875 1116.5665 1129.1930 1133.1183 1174.3310 1183.2303 1191.2532 1196.1091 1209.0065 1217.9743 1251.7657 1253.6195 1258.8096 1261.9294 1270.4616 1273.3569 1278.9079 1300.1645 1305.6642 1312.3192 1326.1261 1329.8238 1335.0872 1337.5595 1340.5259 1341.0087 1345.6089 1348.8205 1364.4986 1368.1132 1375.0899 1396.4481 1436.2200 1446.4360 1450.0960 1458.1647 1458.4809 1460.3665 1462.5295 1462.8012 1468.9965 1470.4314 1472.7256 1474.6729 1478.4708 1488.5854 1492.0683 1495.8065 2917.3862 2944.8037 2961.9664 2963.0214 2964.2523 2965.5363 2965.6127 2968.1935 2970.5196 2972.8135 2977.6659 2984.0203 2987.2209 2992.6155 3022.2583 3024.2288 3029.5752 3034.2463 3037.1324 3046.5112 3057.2131 3059.0776 3063.8636 3066.2273 3076.2503 3081.7530 3093.2049 3095.1424 3113.1060
redmass: 3.8660 4.9079 4.6327 4.7305 2.7999 3.2682 2.5661 2.9917 3.8350 2.7824 2.1920 1.3249 1.7291 3.4399 1.4406 3.0757 2.2438 1.8114 2.1414 2.0383 3.1686 2.0417 2.3846 2.5436 2.6725 3.0194 3.0994 2.7123 1.7761 3.6178 2.6404 2.7068 3.0993 3.4464 2.1777 1.4650 1.4678 3.4343 3.1406 1.6785 2.3744 2.6142 1.6459 1.4337 2.4958 2.1224 2.2433 1.5696 1.6678 1.9124 1.7560 2.1548 2.3523 2.2042 2.6327 2.3544 1.4003 1.5242 3.2326 1.4342 1.7981 2.5233 3.1761 2.1324 2.1423 1.7352 1.7635 1.0969 2.0415 2.1475 1.7047 1.4376 1.4432 1.4632 1.3106 1.3172 1.3285 1.4363 1.2372 1.2804 1.3195 1.2742 1.4032 1.3758 1.3996 1.2308 1.5169 1.4111 1.3525 1.4567 1.2597 1.2033 1.2005 1.6556 1.0802 1.0821 1.1034 1.0908 1.0948 1.1128 1.1266 1.0702 1.0667 1.2342 1.2316 1.0837 1.0814 1.0691 1.0582 1.0819 1.0683 1.0623 1.0599 1.0607 1.0661 1.0670 1.0398 1.0579 1.0451 1.0522 1.0625 1.0653 1.0671 1.0973 1.0955 1.1007 1.0983 1.1017 1.1001 1.0987 1.1019 1.0981 1.0984 1.0988 1.0960 1.0984 1.0948 1.0936
irintensity: 0.1803 0.3713 1.7309 2.4807 0.0409 0.1264 0.1862 0.3982 2.1428 3.1560 0.0134 0.2209 0.1682 2.1205 0.1395 6.8958 5.6744 3.9277 0.7410 0.1978 1.0705 0.3613 2.4531 1.7828 0.6071 0.0373 1.0874 0.4112 2.9158 4.5132 11.7829 5.8464 5.0185 1.0863 0.2744 1.5074 0.1461 11.4123 7.4468 0.1799 10.2200 6.3651 0.2983 10.5624 3.0823 0.3127 1.4753 3.1043 16.4700 6.6313 38.1598 10.5263 16.6836 8.3008 7.3816 45.3972 0.1458 0.2805 29.2247 3.2136 15.2304 0.0162 8.9798 0.3231 3.3810 3.4844 13.5782 1.6161 3.0388 5.9643 19.6322 55.8282 5.9549 27.1858 1.6667 9.7727 45.7150 48.3051 15.3197 2.4802 7.2521 1.9820 0.6138 0.0702 0.8716 2.2887 0.0525 0.8653 3.9542 4.8423 0.5604 22.8657 22.6096 111.2971 6.6102 1.2127 9.9306 2.4346 9.1537 19.8288 1.6256 13.4734 4.3950 51.8533 27.6045 7.7060 21.3230 2.1898 17.6850 24.5099 55.4993 49.1485 42.0818 13.2586 5.7947 53.9617 21.8298 38.7362 43.8727 10.6505 11.9652 73.4601 48.0509 75.1449 80.1821 5.8342 28.2670 48.2944 91.1450 4.3918 15.5055 103.6963 46.0838 34.7436 34.8483 34.2294 9.6838 13.7098
temp: 298.150 k
press: 1.00000 atm
elementType: 16 8 7 6 6 6 6 6 6 6 6 6 6 6 6 6 6 6 6 1 1 1 1 1 1 1 1 1 1 1 1 1 1 1 1 1 1 1 1 1 1 1 1 1 1 1 1 1
symmnumber: 1
zpe: 1119745.3 jmol-1
zpe.correction: 0.426488 hartree
zpe.thermalcorrener: 0.446809 hartree
zpe.thermalcorrenthalpy: 0.447754 hartree
zpe.thermalcorrgfe: 0.376480 hartree
zpe.sumelectzpe: -1153.590178 hartree
zpe.sumelectthermal: -1153.569857 hartree
zpe.sumelectthermalent: -1153.568913 hartree
zpe.sumelectthermalfe: -1153.640187 hartree
dipole: -1.3411 2.2414 2.8821
dipole: 3.8896
quadrupole: -125.5016 -139.7884 -125.7091
quadrupole: 2.8517 3.4836 -6.2896
quadrupole: 4.8314 -9.4554 4.6239 2.8517 3.4836 -6.2896
hfenergy: -1154.0166664 hartree
pointgroup: C01 [X(C16H29N1O1S1)]
dipole: 0.5236042 0.3777139 -1.3874324 debye
polarizability: 210.7890259|-7.5164375|182.426631|-0.3462035|-16.4678176|194.8713952 unknown
InChI: InChI=1S/C16H29NOS/c1-16(2,14-6-4-3-5-7-14)9-8-15(19)17-10-12-18-13-11-17/h14H,3-13H2,1-2H3
charge 0 multiplicity 1
48 atoms
S  -2.434302 -1.446226 2.479564
O  -3.925779 2.384921 -0.814978
N  -3.008959 -0.205086 0.111521
C  2.75041 -0.352491 -0.302303
C  1.500996 -1.273525 -0.61816
C  2.533435 1.152467 -0.631044
C  3.287693 -0.48059 1.150967
C  0.236985 -0.751476 0.138658
C  3.830872 1.976449 -0.438275
C  4.583328 0.342699 1.359458
C  4.379701 1.831629 0.99948
C  1.246051 -1.265035 -2.153365
C  1.817195 -2.737362 -0.198732
C  -1.006817 -1.687506 0.084056
C  -2.19732 -1.071038 0.811785
C  -4.191609 0.448621 0.726457
C  -2.820787 0.207895 -1.302299
C  -4.076214 1.977498 0.596605
C  -2.736816 1.749238 -1.393366
H  3.561464 -0.717771 -0.975223
H  2.170981 1.27925 -1.669241
H  1.752011 1.567428 0.038423
H  2.519821 -0.126136 1.869089
H  3.490653 -1.53905 1.396277
H  -0.036295 0.243019 -0.266842
H  0.477601 -0.600389 1.20826
H  3.638796 3.042301 -0.671171
H  4.598112 1.624168 -1.159092
H  5.387467 -0.078407 0.72008
H  4.92526 0.244264 2.408336
H  5.331369 2.387813 1.106645
H  3.659977 2.285229 1.712308
H  0.430753 -1.959644 -2.43013
H  0.975097 -0.259676 -2.525451
H  2.152271 -1.592032 -2.6980
H  1.07723 -3.440136 -0.623122
H  1.807347 -2.867621 0.898121
H  2.814074 -3.042157 -0.570751
H  -1.25666 -1.949009 -0.962562
H  -0.775936 -2.627049 0.608065
H  -4.237275 0.13711 1.784906
H  -5.100803 0.095475 0.201111
H  -3.691134 -0.143213 -1.892248
H  -1.908565 -0.23589 -1.725208
H  -4.996502 2.471044 0.947687
H  -3.209465 2.342699 1.187319
H  -1.820722 2.103588 -0.871015
H  -2.707888 2.073413 -2.446798
