program: Gaussian 09
title: 000288854
version: EM64L-G09RevD.01
frameworkgroup: C1[X(C16H11BrClNO2)]
method: RPBEPBE
basis: SDD
operation: Freq
keyword: #p
keyword: freq=noraman
keyword: PBEPBE/SDD
title: #p freq=noraman PBEPBE/SDD
converged: YES YES NO NO
title: Mulliken charges:
elementType: Br Cl O O N C C C C C C C C C C C C C C C C H H H H H H H H H H H
charge: 0.064710 -0.014144 -0.206007 -0.204449 0.026280 -0.277083 -0.612677 -0.419462 -0.400793 0.372573 0.373272 0.616065 -0.413790 -0.399652 -0.422455 -0.284510 -0.215043 -0.218196 -0.357329 -0.367148 0.382217 0.319535 0.308566 0.276924 0.255766 0.253744 0.245979 0.274233 0.232911 0.232872 0.288671 0.288421
chargesum: 0.00000
title: Mulliken charges with hydrogens summed into heavy atoms:
elementType: Br Cl O O N C C C C C C C C C C C C C C C C
charge: 0.064710 -0.014144 -0.206007 -0.204449 0.026280 -0.277083 -0.293142 -0.110895 -0.123869 0.372573 0.373272 0.616065 -0.158024 -0.145909 -0.176476 -0.010277 0.017867 0.014676 -0.068658 -0.078727 0.382217
polarizability: 2.67067534e+02 2.39499565e+01 2.49541915e+02 -1.28631037e+01 1.61826494e+01 1.83657965e+02
1716.lowfreq: -7.0755 -1.9804 -0.0014 0.0005 0.0007 5.4757 19.8656 30.5922 42.0907
frequency: 19.7367 30.5748 42.0896 58.2341 72.7562 94.0383 109.4978 122.4337 143.1301 151.1448 194.8926 205.5930 250.6983 275.4567 294.9112 318.8708 344.8863 406.4950 411.7385 435.6220 456.2965 487.2809 503.7817 516.7707 541.4403 553.5639 618.5821 619.4651 645.6476 671.4387 697.1673 708.9595 716.0871 741.0267 751.1333 768.8039 779.4112 787.0516 830.6287 843.3209 843.6302 860.9689 869.5151 885.1021 888.5480 970.4799 972.0055 984.8043 990.4983 992.7401 1005.2366 1052.3051 1091.2194 1093.9284 1112.6512 1136.9856 1163.5879 1169.0248 1182.3874 1196.7157 1211.3826 1219.8503 1238.3143 1245.3840 1278.9304 1310.0385 1359.5159 1367.5813 1377.6336 1403.4344 1418.0170 1419.7561 1477.4559 1525.2968 1544.4087 1560.0974 1595.1113 1605.4665 1636.5514 3084.1821 3131.0240 3139.3481 3140.0631 3154.7936 3165.7411 3167.6756 3184.4071 3187.6081 3203.4196 3214.6053
redmass: 6.9541 8.2827 10.5922 10.0113 5.6323 4.3002 13.6143 9.7822 11.0154 10.9109 8.2846 6.7058 8.0050 5.5938 3.6293 7.8809 5.0610 3.7648 4.4441 4.1261 2.7040 3.5979 7.3207 3.1363 6.2072 6.7816 5.9532 5.9487 5.7596 3.8523 2.7782 2.1719 2.5227 2.6589 3.0989 3.8069 2.2631 5.1457 2.7346 1.2929 1.8847 1.7199 2.0087 5.3435 3.7688 2.4851 1.3383 1.3490 1.3765 1.3386 3.1138 3.5712 3.3972 2.6249 1.3806 1.7584 1.2003 1.0906 1.3564 1.4959 1.5740 5.1760 1.9320 2.5648 1.4846 1.3505 1.5749 6.9616 2.5410 7.8200 2.9864 3.1640 2.4199 7.9664 6.6288 5.3768 7.6675 6.3617 6.9806 1.0870 1.0852 1.0878 1.0908 1.0974 1.0892 1.1007 1.0947 1.0964 1.0960 1.0973
irintensity: 0.4222 0.8027 0.2619 1.0742 0.0466 0.7408 2.0347 1.8335 2.3917 0.3841 4.0090 1.6825 3.2877 1.5007 0.9104 1.6903 7.1184 8.7772 6.4101 2.3135 30.0882 5.2149 0.4142 0.7335 19.4681 2.9078 2.9681 10.8147 13.6046 49.2090 12.9610 12.6481 48.9683 1.3093 12.9190 27.5939 5.2845 8.2534 36.3059 14.7292 137.5065 0.4988 18.8478 0.5404 1.9960 1.2000 2.0869 3.4265 0.2611 0.0175 3.6184 6.4608 8.1281 19.7684 10.5137 3.9451 5.1991 2.8181 76.0260 11.0412 26.2877 318.0171 2.6816 5.4542 8.3351 1.5997 3.4777 89.4285 0.2895 1.1282 14.0919 48.7888 2.2290 12.9448 28.3348 0.8432 0.8831 36.4640 1.6211 1.1580 0.9110 0.7173 5.6517 23.6732 1.7972 32.7116 0.6185 3.5594 0.3423 2.0464
temp: 298.150 k
press: 1.00000 atm
elementType: 35 17 8 8 7 6 6 6 6 6 6 6 6 6 6 6 6 6 6 6 6 1 1 1 1 1 1 1 1 1 1 1
symmnumber: 1
zpe: 593647.3 jmol-1
zpe.correction: 0.226108 hartree
zpe.thermalcorrener: 0.244426 hartree
zpe.thermalcorrenthalpy: 0.245370 hartree
zpe.thermalcorrgfe: 0.176618 hartree
zpe.sumelectzpe: -1293.439211 hartree
zpe.sumelectthermal: -1293.420893 hartree
zpe.sumelectthermalent: -1293.419949 hartree
zpe.sumelectthermalfe: -1293.488701 hartree
dipole: -3.0998 1.9298 -1.0006
dipole: 3.7860
quadrupole: -181.0862 -127.6331 -126.0718
quadrupole: -9.0454 -1.6730 6.0126
quadrupole: -36.1559 17.2972 18.8586 -9.0454 -1.6730 6.0126
hfenergy: -1293.6653191 hartree
pointgroup: C01 [X(C16H11Br1Cl1N1O2)]
dipole: 1.3789534 0.4825782 0.2904174 debye
polarizability: 253.6848318|-27.6862044|258.0956361|-16.0311018|-19.8070034|188.4869465 unknown
InChI: InChI=1S/C16H11BrClNO2/c17-16(9-12-3-1-2-4-13(12)10-16)15(18)11-5-7-14(8-6-11)19(20)21/h1-10,15H
charge 0 multiplicity 1
32 atoms
Br 3.51782 -2.504099 0.721965
Cl 0.621884 -3.57505 -0.997493
O  -5.107246 0.74077 1.28626
O  -4.677243 1.385441 -0.859575
N  -4.374774 0.749117 0.222497
C  1.859169 -1.338624 0.254707
C  0.606212 -2.235147 0.365003
C  2.154343 -0.679652 -1.076292
C  1.858294 -0.201726 1.2654
C  2.317586 0.677363 -0.863791
C  2.125935 0.975948 0.592886
C  -0.697484 -1.461781 0.292725
C  2.629834 1.759745 -1.776054
C  2.250273 2.342017 1.061684
C  -1.548492 -1.448893 1.428598
C  -1.085732 -0.756719 -0.876899
C  2.737796 3.044147 -1.274649
C  2.54634 3.336002 0.146532
C  -2.756297 -0.725996 1.417007
C  -2.286945 -0.026552 -0.905068
C  -3.104359 -0.018099 0.246783
H  0.659643 -2.820995 1.295356
H  2.241581 -1.241113 -2.005876
H  1.69523 -0.34965 2.33331
H  2.778605 1.552538 -2.841035
H  2.11111 2.572179 2.123171
H  -1.264434 -2.008335 2.326875
H  -0.45091 -0.796317 -1.76592
H  2.97364 3.877713 -1.945655
H  2.644376 4.375769 0.478195
H  -3.425056 -0.701797 2.281051
H  -2.605298 0.525898 -1.792796
