program: Gaussian 09
title: 000288837
version: EM64L-G09RevD.01
frameworkgroup: C1[X(C16H14N2O2)]
method: RPBEPBE
basis: SDD
operation: Freq
keyword: #p
keyword: freq=noraman
keyword: PBEPBE/SDD
title: #p freq=noraman PBEPBE/SDD
converged: YES YES NO NO
title: Mulliken charges:
elementType: O O N N C C C C C C C C C C C C C C C C H H H H H H H H H H H H H H
charge: -0.418095 -0.196150 -0.251250 -0.037538 -0.189547 -0.610149 0.058818 0.417719 0.346718 0.183957 -0.369101 -0.380804 -0.369464 -0.367078 -0.233569 -0.196922 -0.246721 -0.229089 -0.263239 -0.237922 0.292799 0.255441 0.269073 0.266926 0.270459 0.232980 0.262060 0.221505 0.223365 0.225721 0.227982 0.226914 0.384158 0.230043
chargesum: 0.00000
title: Mulliken charges with hydrogens summed into heavy atoms:
elementType: O O N N C C C C C C C C C C C C C C C C
charge: -0.033937 -0.196150 -0.251250 -0.037538 0.103251 -0.085634 0.058818 0.417719 0.346718 0.183957 -0.102175 -0.110344 -0.136484 -0.105019 -0.012064 0.026443 -0.021000 -0.001107 -0.036325 -0.007879
polarizability: 3.82388528e+02 -1.29063639e+01 1.97043576e+02 -5.16791699e+00 -1.98448298e+01 9.77821556e+01
1716.lowfreq: -8.2629 -5.8344 -1.7617 0.0003 0.0006 0.0008 26.4548 31.6780 42.1723
frequency: 26.4275 31.6686 42.1305 53.5373 71.8820 83.2277 115.5460 150.1836 198.0477 226.1775 248.0939 262.5418 302.7461 326.7264 387.6102 403.4916 411.4026 432.8300 457.1712 503.0503 515.2692 536.4181 595.4409 613.2168 614.7605 621.5191 663.5740 680.9184 695.4418 696.1473 718.6334 757.1762 767.8821 791.8436 834.9717 848.6285 857.9640 872.4961 899.0047 920.5236 968.3580 979.4695 979.6339 980.7822 984.9744 987.4421 995.9381 999.0296 1003.6666 1017.3342 1029.7990 1038.8769 1054.4761 1062.6625 1088.2861 1106.5476 1169.0323 1171.0185 1172.9886 1190.1460 1194.4183 1238.4146 1260.5642 1276.2002 1301.6396 1322.9897 1332.7015 1350.9973 1381.5693 1385.7163 1392.9762 1437.8292 1449.3440 1452.7382 1486.8030 1497.8524 1546.4413 1581.8369 1587.8842 1612.2716 1615.4671 1673.6616 3010.5249 3035.6367 3070.7204 3124.6206 3126.8395 3132.5140 3135.6995 3144.9750 3157.1308 3157.6516 3167.6623 3169.0580 3185.3109 3509.1229
redmass: 8.5581 4.7448 5.2053 4.1980 4.9933 4.6764 4.9202 4.7843 4.7131 4.4774 4.8353 5.4763 6.5155 5.5761 4.9895 2.8346 2.9614 4.8289 4.1343 3.6444 4.2239 2.9101 4.5863 6.3989 5.7093 1.3560 6.4985 5.8235 2.0670 1.7639 4.5028 1.6805 1.8841 3.2740 1.2569 1.2586 6.5663 6.7420 1.4375 1.4359 1.3626 1.4982 4.6390 2.3082 4.8855 1.3292 6.0347 1.4000 3.7426 3.4299 2.1118 2.0200 2.4761 2.6266 1.6190 1.8596 1.1889 1.0976 1.0611 1.1200 1.1262 1.4649 1.4867 1.3884 2.6052 1.4375 1.4279 1.6899 6.1416 7.5121 3.6416 2.3937 2.3020 1.1905 2.3715 2.9611 7.0944 6.0689 6.4959 5.9919 6.0135 8.6155 1.0604 1.0873 1.1033 1.0847 1.0849 1.0877 1.0898 1.0930 1.0936 1.0960 1.0980 1.1007 1.0953 1.0641
irintensity: 0.8953 0.2184 0.8940 0.1472 0.7790 0.6251 1.2192 2.0629 1.6117 2.3140 1.6135 0.5315 1.3156 0.1654 3.2781 0.0324 0.1203 30.5504 3.8702 5.6294 10.0861 13.8363 25.2393 1.4090 3.0783 91.6027 3.2831 22.8798 50.1115 36.7258 43.5811 67.3735 72.5805 8.9195 0.7069 0.1125 0.6796 30.3734 9.4325 6.4746 1.2805 0.4249 5.1246 3.6178 5.3828 1.7652 21.1504 0.5662 18.4595 98.1986 9.8716 22.5930 247.8723 86.9114 3.6650 91.8779 3.9806 1.5456 0.3726 0.7659 2.0637 7.0418 60.9021 15.7107 35.6955 13.2258 28.0212 27.4512 26.6271 6.5738 172.4650 11.1274 11.3989 12.8870 96.7607 207.6795 80.8249 16.8953 4.9891 100.1605 120.4293 158.3706 16.2725 11.6131 6.9361 7.9367 5.5479 1.6010 19.2111 28.8497 31.5448 25.1770 19.7442 22.1271 3.6448 33.6552
temp: 298.150 k
press: 1.00000 atm
elementType: 8 8 7 7 6 6 6 6 6 6 6 6 6 6 6 6 6 6 6 6 1 1 1 1 1 1 1 1 1 1 1 1 1 1
symmnumber: 1
zpe: 692186.6 jmol-1
zpe.correction: 0.263640 hartree
zpe.thermalcorrener: 0.280381 hartree
zpe.thermalcorrenthalpy: 0.281325 hartree
zpe.thermalcorrgfe: 0.216883 hartree
zpe.sumelectzpe: -876.635198 hartree
zpe.sumelectthermal: -876.618458 hartree
zpe.sumelectthermalent: -876.617514 hartree
zpe.sumelectthermalfe: -876.681956 hartree
dipole: -0.2757 2.3344 -1.7790
dipole: 2.9479
quadrupole: -99.7419 -100.6176 -125.0468
quadrupole: 4.5407 1.2069 -6.5271
quadrupole: 8.7269 7.8511 -16.5780 4.5407 1.2069 -6.5271
hfenergy: -876.8988383 hartree
pointgroup: C01 [X(C16H14N2O2)]
dipole: -0.1539487 0.9071048 -0.7060885 debye
polarizability: 383.2206244|-3.5693658|195.9433748|-3.9572893|-20.7388192|98.0502603 unknown
InChI: InChI=1S/C16H14N2O2/c19-16(20)15-11-14(12-7-3-1-4-8-12)17-18(15)13-9-5-2-6-10-13/h1-10,15,19H,11H2
charge 0 multiplicity 1
34 atoms
O  2.228658 3.352382 -0.093689
O  0.850969 2.653432 1.645381
N  0.917435 0.136754 -0.172092
N  -0.260337 -0.575153 0.031141
C  0.676346 1.557865 -0.578431
C  -0.881103 1.627541 -0.630714
C  -1.298834 0.21181 -0.215713
C  2.17306 -0.503963 -0.115877
C  -2.685343 -0.240776 -0.0988
C  1.231057 2.540407 0.4644
C  3.360898 0.20644 -0.447036
C  2.256893 -1.873276 0.264388
C  -3.760284 0.648626 -0.385686
C  -2.991415 -1.576447 0.299187
C  4.608326 -0.451796 -0.394917
C  3.511445 -2.509648 0.312559
C  -5.099334 0.21613 -0.281004
C  -4.32806 -2.001926 0.402993
C  4.698289 -1.809501 -0.015155
C  -5.391113 -1.109391 0.113089
H  1.15401 1.770013 -1.550412
H  -1.248748 1.881552 -1.640101
H  -1.275174 2.376306 0.078997
H  3.323966 1.258758 -0.744049
H  1.338692 -2.410225 0.512627
H  -3.552085 1.681107 -0.688725
H  -2.166375 -2.260043 0.522716
H  5.514911 0.106579 -0.655005
H  3.562422 -3.563653 0.608986
H  -5.91465 0.913177 -0.504624
H  -4.547524 -3.030435 0.710783
H  5.669956 -2.312565 0.024955
H  2.571424 3.984176 0.595907
H  -6.430878 -1.444357 0.195521
