program: Gaussian 09
title: 000288850
version: EM64L-G09RevD.01
frameworkgroup: C1[X(C18H12N2O6)]
method: RPBEPBE
basis: SDD
operation: Freq
keyword: #p
keyword: freq=noraman
keyword: PBEPBE/SDD
title: #p freq=noraman PBEPBE/SDD
converged: YES YES NO NO
title: Mulliken charges:
elementType: O O O O O O N N C C C C C C C C C C C C C C C C C C H H H H H H H H H H H H
charge: -0.203974 -0.203986 -0.196552 -0.196553 -0.188449 -0.188449 0.012667 0.012667 0.343520 0.343477 0.214045 0.214037 -0.348347 -0.348338 -0.201774 -0.201749 -0.355722 -0.355727 -0.242853 -0.242849 -0.207763 -0.207764 -0.289790 -0.289815 0.057352 0.057362 0.260408 0.260424 0.292377 0.292364 0.286511 0.286508 0.245283 0.245283 0.248359 0.248358 0.274713 0.274738
chargesum: 0.00000
title: Mulliken charges with hydrogens summed into heavy atoms:
elementType: O O O O O O N N C C C C C C C C C C C C C C C C C C
charge: -0.203974 -0.203986 -0.196552 -0.196553 -0.188449 -0.188449 0.012667 0.012667 0.343520 0.343477 0.214045 0.214037 -0.087939 -0.087914 0.090604 0.090614 -0.069211 -0.069219 0.002429 0.002434 0.040596 0.040595 -0.015076 -0.015077 0.057352 0.057362
polarizability: 5.00417178e+02 3.53958312e+01 2.45128323e+02 -1.18498233e-04 -1.21820458e-03 1.17389673e+02
1716.lowfreq: -6.9087 -5.0666 -0.3197 -0.0010 -0.0005 -0.0001 9.8789 12.6506 24.0741
frequency: 9.8784 12.4282 23.9607 27.1460 42.8536 60.5921 75.5545 76.4544 83.6107 109.3883 118.8314 137.9434 149.0198 156.8500 184.7142 225.6326 244.8283 277.6686 282.0024 302.5526 314.4271 374.1049 374.2857 388.2159 404.8656 435.1590 439.0208 452.5313 499.9393 516.6889 528.9430 546.3659 567.0128 575.0104 596.4897 642.3822 648.6268 664.6404 666.5310 719.0019 722.0067 734.8799 766.0791 775.4705 782.5931 782.8340 790.9751 825.3158 866.0913 881.5633 890.1218 892.6373 920.5250 921.4996 975.7220 977.0570 986.5013 986.6938 1003.0722 1003.2287 1020.8719 1040.9479 1041.7037 1060.3147 1063.2371 1133.8815 1134.0835 1163.7831 1175.5955 1176.2274 1203.6286 1203.8699 1216.2526 1216.5328 1280.5127 1281.3484 1290.2935 1302.2505 1302.4796 1324.3425 1365.7168 1366.0937 1387.6240 1388.8448 1434.2779 1434.8201 1469.1129 1470.2100 1543.7567 1553.9289 1567.8408 1568.1011 1604.0201 1604.0615 1625.0835 1629.9755 3136.6535 3136.9284 3146.0726 3146.1192 3151.7529 3152.7442 3161.1294 3161.1688 3173.1760 3173.1980 3188.0067 3188.0140
redmass: 9.4540 7.3766 7.7021 9.8892 11.9356 13.6031 5.7377 8.4269 6.3756 5.4163 5.9009 5.0238 4.2799 5.0958 5.4681 7.1490 6.8817 8.0184 6.9004 3.6107 3.6088 8.9898 9.7321 5.3413 4.6856 3.8506 3.5431 6.8437 3.5413 5.5181 5.2820 5.6155 6.0438 6.1473 5.7661 7.0165 7.3500 5.1037 5.2180 8.1717 3.2840 3.6555 8.2500 4.2106 1.4496 1.8018 4.5948 6.4384 3.3373 1.5073 2.1535 1.5734 2.4369 3.0531 1.3635 1.3592 1.1523 1.1381 1.3443 1.3413 3.3741 2.9098 3.1803 2.9894 2.6682 1.9652 1.9992 2.2510 1.1304 1.1892 6.4643 6.1201 1.6701 1.6433 1.5912 1.7752 2.1262 1.3803 1.3723 2.7633 6.2846 6.3815 5.1661 5.0533 2.5762 2.5663 2.5676 2.5818 11.4322 11.0656 5.9712 6.0143 6.6817 6.6893 5.6634 5.9744 1.0925 1.0925 1.0868 1.0868 1.0885 1.0891 1.0910 1.0910 1.0964 1.0964 1.0978 1.0978
irintensity: 1.7605 5.0621 3.1173 0.7311 0.0011 0.1746 0.1761 0.1639 0.2349 1.1772 0.7647 5.5654 0.4832 0.2369 1.9229 0.0954 2.0945 40.5459 0.0133 1.2169 1.5334 3.5074 0.0515 30.3227 0.0957 21.2899 9.8064 1.8931 15.3590 2.0419 1.0330 9.3034 0.1595 38.9001 4.8084 25.4884 1.3448 2.4115 28.8405 67.5825 10.0516 19.6474 11.6415 3.2332 84.3497 68.5153 21.6962 3.4722 23.8609 0.8354 3.8373 1.9405 4.3195 0.2859 3.8616 1.0739 8.0206 68.6155 0.9783 2.5375 184.9280 0.0298 18.8050 1.4672 49.5600 0.8078 3.4663 0.0138 22.8202 10.0902 309.5611 89.8732 1.4554 51.9166 62.3053 0.3537 374.9213 0.4002 98.4107 0.5215 199.2966 14.5197 1.3489 0.0016 32.2414 0.0464 165.5486 0.0103 831.0369 3.9832 51.7174 2.1209 4.4626 1.2418 291.4305 0.1314 7.9704 0.0049 3.8840 0.2202 29.1111 0.4260 8.0128 0.3077 15.5218 2.8651 11.2282 3.1779
temp: 298.150 k
press: 1.00000 atm
elementType: 8 8 8 8 8 8 7 7 6 6 6 6 6 6 6 6 6 6 6 6 6 6 6 6 6 6 1 1 1 1 1 1 1 1 1 1 1 1
symmnumber: 1
zpe: 693843.7 jmol-1
zpe.correction: 0.264271 hartree
zpe.thermalcorrener: 0.287196 hartree
zpe.thermalcorrenthalpy: 0.288140 hartree
zpe.thermalcorrgfe: 0.206347 hartree
zpe.sumelectzpe: -1251.941005 hartree
zpe.sumelectthermal: -1251.918080 hartree
zpe.sumelectthermalent: -1251.917136 hartree
zpe.sumelectthermalfe: -1251.998929 hartree
dipole: 0.0001 0.0001 -4.0096
dipole: 4.0096
quadrupole: -109.5651 -156.4534 -152.8566
quadrupole: 58.8863 0.0008 0.0016
quadrupole: 30.0599 -16.8284 -13.2316 58.8863 0.0008 0.0016
hfenergy: -1252.2052765 hartree
pointgroup: C01 [X(C18H12N2O6)]
dipole: 0.0000255 -1.5774781 0.0016636 debye
polarizability: 505.0208475|0.0112791|117.3897995|-7.51036|0.124593|240.5245262 unknown
InChI: InChI=1S/C18H12N2O6/c21-17(11-9-13-5-1-3-7-15(13)19(23)24)18(22)12-10-14-6-2-4-8-16(14)20(25)26/h1-12H
charge 0 multiplicity 1
38 atoms
O  -0.389332 -0.299256 -1.740578
O  0.390878 -0.296268 1.742853
O  -6.474152 1.112087 -2.901001
O  6.475489 1.118842 2.900365
O  -4.286793 1.566924 -2.455829
O  4.288044 1.572377 2.454305
N  -5.43156 1.055498 -2.140681
N  5.432926 1.060604 2.140129
C  -4.440514 -0.09591 -0.096527
C  4.441998 -0.095332 0.098459
C  -5.575993 0.38951 -0.818241
C  5.57742 0.391791 0.819121
C  -4.707363 -0.657474 1.187724
C  4.708909 -0.659601 -1.184591
C  -3.070032 -0.117517 -0.635681
C  3.071516 -0.116016 0.637658
C  -6.890191 0.311091 -0.308407
C  6.891625 0.312422 0.309454
C  -6.009142 -0.720492 1.718756
C  6.010695 -0.723599 -1.715493
C  -7.109303 -0.239837 0.968163
C  7.110801 -0.241213 -0.965933
C  -1.934713 -0.149743 0.132607
C  1.936208 -0.149669 -0.130583
C  -0.599449 -0.222071 -0.489792
C  0.600953 -0.2209 0.491947
H  -3.873899 -1.080476 1.756477
H  3.87549 -1.083932 -1.752422
H  -2.935046 -0.11368 -1.723557
H  2.936531 -0.110242 1.725524
H  -7.713187 0.694326 -0.916878
H  7.714574 0.697074 0.917095
H  -6.169334 -1.1565 2.710116
H  6.170932 -1.161716 -2.705916
H  -8.124332 -0.29257 1.37353
H  8.125836 -0.294695 -1.371187
H  -1.947148 -0.085877 1.225892
H  1.948658 -0.087761 -1.223981
