program: Gaussian 09
title: 000288832
version: EM64L-G09RevD.01
frameworkgroup: C1[X(C16H12Br2O)]
method: RPBEPBE
basis: SDD
operation: Freq
keyword: #p
keyword: freq=noraman
keyword: PBEPBE/SDD
title: #p freq=noraman PBEPBE/SDD
converged: YES YES NO NO
title: Mulliken charges:
elementType: Br Br O C C C C C C C C C C C C C C C C H H H H H H H H H H H H
charge: 0.070479 0.019422 -0.173150 -0.294424 -0.566912 -0.701430 0.377608 0.070822 0.209711 0.533247 -0.398707 -0.372121 -0.208889 -0.225047 -0.351218 -0.388290 -0.244028 -0.232379 -0.233722 0.266634 0.290344 0.343049 0.249269 0.273883 0.234120 0.238683 0.249730 0.265273 0.230712 0.233917 0.233414
chargesum: 0.00000
title: Mulliken charges with hydrogens summed into heavy atoms:
elementType: Br Br O C C C C C C C C C C C C C C C C
charge: 0.070479 0.019422 -0.173150 -0.294424 -0.009934 -0.358381 0.377608 0.070822 0.209711 0.533247 -0.149438 -0.098238 0.025231 0.013636 -0.101488 -0.123017 -0.013315 0.001539 -0.000309
polarizability: 2.05939086e+02 -9.78958353e+00 2.19350895e+02 3.23581812e+00 7.37732981e+00 1.87453914e+02
1716.lowfreq: -8.5378 -7.4794 -3.2968 -0.0005 -0.0005 -0.0004 25.7895 30.5743 59.8208
frequency: 25.7604 30.4777 59.8029 72.2732 96.8713 109.9114 124.6556 154.7133 169.3589 193.6407 209.2747 228.1683 254.9354 274.7616 299.0522 404.7556 408.3945 449.2283 469.9940 494.5391 521.6823 547.6340 582.0787 612.1228 616.3035 624.9451 673.2668 694.8368 705.3719 726.0901 747.8054 768.6860 798.5709 817.8491 835.8190 854.6730 885.3152 893.5408 932.9179 957.2107 978.8786 983.7055 991.6695 998.9498 1002.2298 1007.1001 1018.2081 1028.4856 1085.5505 1091.3591 1131.8784 1169.3086 1172.7754 1173.5556 1179.4665 1188.3706 1196.2454 1210.1903 1228.5690 1272.2292 1283.8472 1302.3511 1337.5347 1382.4816 1400.2401 1436.4352 1439.4505 1453.8131 1466.5074 1479.2051 1587.6359 1596.5894 1607.0643 1613.3845 1632.9362 3005.3507 3086.0359 3088.6644 3127.5147 3130.4149 3135.3815 3143.0254 3145.8345 3154.0261 3155.1160 3168.6399 3169.0589
redmass: 6.3034 7.9631 4.9283 7.4652 4.7291 19.1093 6.6598 12.8788 7.9568 6.0928 8.5211 5.8244 5.8062 7.4042 2.4151 2.8490 3.1822 4.2983 3.1494 4.9406 5.0982 6.7071 6.2978 6.1117 5.9608 5.3319 3.9364 5.1412 1.7941 4.3176 1.7475 1.9453 2.5472 4.1051 3.9998 1.2487 1.4767 3.8275 1.4342 1.6619 1.5647 1.8565 3.9959 1.3201 1.3518 5.2221 2.1163 2.2609 1.6311 2.2510 2.4903 1.1865 1.1672 1.1562 1.2678 2.1673 1.1257 2.2745 2.2520 2.0753 1.4305 1.6214 1.2518 6.7163 7.6053 1.6703 1.3885 2.4204 2.3077 2.1779 5.8820 7.2220 5.9945 7.3351 11.8931 1.0655 1.0949 1.0864 1.0850 1.0865 1.0877 1.0899 1.0923 1.0950 1.0964 1.1015 1.1004
irintensity: 0.7176 0.0299 0.2933 0.3465 0.7011 0.2208 1.8179 3.1772 0.5940 1.5928 0.7383 1.0734 0.9877 7.1200 7.6435 1.9289 0.3999 6.9844 4.9542 14.1912 25.5297 11.2637 34.8015 2.1201 46.9699 16.5787 2.3390 12.3792 72.6147 1.7490 31.3157 35.7623 28.1326 4.1506 1.5526 0.4528 3.7587 12.3722 8.0909 10.7236 0.3925 33.3576 1.3110 0.3563 0.5832 50.1395 0.2493 6.7592 10.2096 8.4909 19.5692 6.5008 2.7988 7.2031 6.8745 13.1394 2.7506 16.6319 27.7271 57.3940 7.4497 9.8754 2.5069 0.4679 6.2503 1.2131 33.3254 25.6782 6.0329 11.6875 2.2335 15.6987 0.0736 118.6135 139.4207 3.3839 1.2903 0.2736 1.5135 0.8894 3.1226 6.8462 15.8797 12.0836 19.0563 19.8703 27.2765
temp: 298.150 k
press: 1.00000 atm
elementType: 35 35 8 6 6 6 6 6 6 6 6 6 6 6 6 6 6 6 6 1 1 1 1 1 1 1 1 1 1 1 1
symmnumber: 1
zpe: 603902.1 jmol-1
zpe.correction: 0.230014 hartree
zpe.thermalcorrener: 0.246697 hartree
zpe.thermalcorrenthalpy: 0.247641 hartree
zpe.thermalcorrgfe: 0.182983 hartree
zpe.sumelectzpe: -717.732733 hartree
zpe.sumelectthermal: -717.716050 hartree
zpe.sumelectthermalent: -717.715106 hartree
zpe.sumelectthermalfe: -717.779764 hartree
dipole: -2.2647 3.6724 -2.9781
dipole: 5.2425
quadrupole: -119.4344 -124.7415 -123.3526
quadrupole: 0.6257 5.7481 0.4598
quadrupole: 3.0751 -2.2320 -0.8431 0.6257 5.7481 0.4598
hfenergy: -717.962747 hartree
pointgroup: C01 [X(C16H12Br2O1)]
dipole: -0.6429124 1.7096173 -0.9581629 debye
polarizability: 203.0591951|-6.0633823|220.9585149|3.0641491|10.5017363|188.7261847 unknown
InChI: InChI=1S/C16H12Br2O/c17-14(11-6-2-1-3-7-11)16(18)10-12-8-4-5-9-13(12)15(16)19/h1-9,14H,10H2
charge 0 multiplicity 1
31 atoms
Br -0.97552 -3.254552 0.385333
Br 2.17297 -2.820954 -1.245694
O  -0.408399 -0.478292 2.309457
C  -0.121731 -1.408673 -0.014681
C  -0.704116 -0.88346 -1.348021
C  1.406218 -1.517726 0.141807
C  -1.886273 -0.018244 -0.93289
C  -0.783406 -0.524213 1.111703
C  -1.896956 0.206255 0.467202
C  2.125115 -0.173537 0.078759
C  -2.873304 0.57244 -1.744096
C  -2.868828 1.025353 1.085348
C  -3.857059 1.38779 -1.132346
C  -3.855648 1.617281 0.270333
C  2.462121 0.475297 -1.137474
C  2.452822 0.459147 1.307704
C  3.098373 1.734886 -1.125662
C  3.088802 1.72002 1.317624
C  3.41091 2.36438 0.101676
H  0.056635 -0.262947 -1.858892
H  -0.973859 -1.699144 -2.036374
H  1.620418 -2.020141 1.097764
H  -2.886209 0.408729 -2.827261
H  -2.846925 1.179319 2.16915
H  -4.634158 1.851614 -1.750438
H  -4.628394 2.253354 0.714777
H  2.278174 -0.02964 -2.092364
H  2.188532 -0.027651 2.252613
H  3.362604 2.21785 -2.072825
H  3.334275 2.194052 2.274034
H  3.909717 3.339807 0.109439
